Home | Search | fuchsia - Builders
Login

Builder toulouse-x64-debug

Machine Pool

Idle1
Busy49
Offline0
50 bots
NameStatusLast Seen
fuchsia-ci-16-us-central1-b-0-s1jt Idle Tuesday, 18-Jun-19 03:43:18 UTC
fuchsia-ci-16-us-central1-b-1-3v8w Busy Tuesday, 18-Jun-19 03:42:58 UTC
fuchsia-ci-16-us-central1-b-10-zell Busy Tuesday, 18-Jun-19 03:42:58 UTC
fuchsia-ci-16-us-central1-b-11-zmxt Busy Tuesday, 18-Jun-19 03:43:22 UTC
fuchsia-ci-16-us-central1-b-12-bj9f Busy Tuesday, 18-Jun-19 03:43:21 UTC
fuchsia-ci-16-us-central1-b-13-k0jy Busy Tuesday, 18-Jun-19 03:43:23 UTC
fuchsia-ci-16-us-central1-b-14-e3jy Busy Tuesday, 18-Jun-19 03:43:05 UTC
fuchsia-ci-16-us-central1-b-15-xwst Busy Tuesday, 18-Jun-19 03:43:00 UTC
fuchsia-ci-16-us-central1-b-16-dqmv Busy Tuesday, 18-Jun-19 03:42:56 UTC
fuchsia-ci-16-us-central1-b-17-y9x2 Busy Tuesday, 18-Jun-19 03:43:18 UTC
fuchsia-ci-16-us-central1-b-18-s6nq Busy Tuesday, 18-Jun-19 03:43:07 UTC
fuchsia-ci-16-us-central1-b-19-jko4 Busy Tuesday, 18-Jun-19 03:43:04 UTC
fuchsia-ci-16-us-central1-b-2-p3ep Busy Tuesday, 18-Jun-19 03:43:11 UTC
fuchsia-ci-16-us-central1-b-20-8u9w Busy Tuesday, 18-Jun-19 03:43:07 UTC
fuchsia-ci-16-us-central1-b-21-r1f4 Busy Tuesday, 18-Jun-19 03:43:21 UTC
fuchsia-ci-16-us-central1-b-22-avnn Busy Tuesday, 18-Jun-19 03:43:13 UTC
fuchsia-ci-16-us-central1-b-23-0yed Busy Tuesday, 18-Jun-19 03:43:12 UTC
fuchsia-ci-16-us-central1-b-24-zqbx Busy Tuesday, 18-Jun-19 03:43:14 UTC
fuchsia-ci-16-us-central1-b-3-k32p Busy Tuesday, 18-Jun-19 03:43:15 UTC
fuchsia-ci-16-us-central1-b-4-61om Busy Tuesday, 18-Jun-19 03:43:22 UTC
fuchsia-ci-16-us-central1-b-5-ogdh Busy Tuesday, 18-Jun-19 03:43:23 UTC
fuchsia-ci-16-us-central1-b-6-asgp Busy Tuesday, 18-Jun-19 03:43:17 UTC
fuchsia-ci-16-us-central1-b-7-0z4x Busy Tuesday, 18-Jun-19 03:43:16 UTC
fuchsia-ci-16-us-central1-b-8-0rwk Busy Tuesday, 18-Jun-19 03:43:10 UTC
fuchsia-ci-16-us-central1-b-9-gqss Busy Tuesday, 18-Jun-19 03:43:08 UTC
fuchsia-ci-16-us-central1-c-0-6xxo Busy Tuesday, 18-Jun-19 03:43:21 UTC
fuchsia-ci-16-us-central1-c-1-ck7x Busy Tuesday, 18-Jun-19 03:43:19 UTC
fuchsia-ci-16-us-central1-c-10-p14s Busy Tuesday, 18-Jun-19 03:43:26 UTC
fuchsia-ci-16-us-central1-c-11-at3y Busy Tuesday, 18-Jun-19 03:43:25 UTC
fuchsia-ci-16-us-central1-c-12-kp3k Busy Tuesday, 18-Jun-19 03:43:16 UTC
fuchsia-ci-16-us-central1-c-13-bqj2 Busy Tuesday, 18-Jun-19 03:43:21 UTC
fuchsia-ci-16-us-central1-c-14-gixg Busy Tuesday, 18-Jun-19 03:43:08 UTC
fuchsia-ci-16-us-central1-c-15-r4va Busy Tuesday, 18-Jun-19 03:43:19 UTC
fuchsia-ci-16-us-central1-c-16-um72 Busy Tuesday, 18-Jun-19 03:43:24 UTC
fuchsia-ci-16-us-central1-c-17-lfqn Busy Tuesday, 18-Jun-19 03:43:20 UTC
fuchsia-ci-16-us-central1-c-18-1q82 Busy Tuesday, 18-Jun-19 03:42:59 UTC
fuchsia-ci-16-us-central1-c-19-9fmy Busy Tuesday, 18-Jun-19 03:42:59 UTC
fuchsia-ci-16-us-central1-c-2-wqq7 Busy Tuesday, 18-Jun-19 03:42:58 UTC
fuchsia-ci-16-us-central1-c-20-bq6x Busy Tuesday, 18-Jun-19 03:43:14 UTC
fuchsia-ci-16-us-central1-c-21-rutd Busy Tuesday, 18-Jun-19 03:43:17 UTC
fuchsia-ci-16-us-central1-c-22-8ha7 Busy Tuesday, 18-Jun-19 03:43:23 UTC
fuchsia-ci-16-us-central1-c-23-cywf Busy Tuesday, 18-Jun-19 03:43:24 UTC
fuchsia-ci-16-us-central1-c-24-jloq Busy Tuesday, 18-Jun-19 03:43:25 UTC
fuchsia-ci-16-us-central1-c-3-b5zl Busy Tuesday, 18-Jun-19 03:43:02 UTC
fuchsia-ci-16-us-central1-c-4-ntpg Busy Tuesday, 18-Jun-19 03:42:58 UTC
fuchsia-ci-16-us-central1-c-5-x453 Busy Tuesday, 18-Jun-19 03:43:10 UTC
fuchsia-ci-16-us-central1-c-6-th38 Busy Tuesday, 18-Jun-19 03:42:58 UTC
fuchsia-ci-16-us-central1-c-7-c519 Busy Tuesday, 18-Jun-19 03:43:17 UTC
fuchsia-ci-16-us-central1-c-8-6nyp Busy Tuesday, 18-Jun-19 03:43:25 UTC
fuchsia-ci-16-us-central1-c-9-ugl5 Busy Tuesday, 18-Jun-19 03:43:05 UTC

Current Builds (1):

No Pending Build Requests

Builder groups

Recent Builds:

Finished Time Run Duration Revision Result Build #Info
Tuesday, 18-Jun-19 03:25:28 UTC 1 hrs 6 mins e5b288ea6bae4c5be4da998c7527236df6026a97 Success 8910350789103574304
Tuesday, 18-Jun-19 02:18:40 UTC 1 hrs 4 mins c007bc290e12ad5815c347a89be355fefef1b2c9 Success 8910354841790762672
Tuesday, 18-Jun-19 01:14:13 UTC 1 hrs 5 mins ddef62ed301269373b4861b61479dbcda99ea1f7 Success 8910358957543445248
Tuesday, 18-Jun-19 00:08:48 UTC 1 hrs 8 mins 1f4a0c379b3a7fbb8e8ba997c0122a6cd1502368 Success 8910363250585287232
Monday, 17-Jun-19 23:00:32 UTC 1 hrs 14 mins cb304766cbf8fe9c07b6a66fb9e3cf76ec3d8aca Success 8910368001190682976
Monday, 17-Jun-19 21:45:05 UTC 1 hrs 11 mins 214159eddf85b0ddb15ea05d832b4428a3f83ba9 Success 8910372696522493520
Monday, 17-Jun-19 20:30:27 UTC 1 hrs 7 mins 380c03f219029ecdd4a0d8272ac3638fc931228b Success 8910376938546356384
Monday, 17-Jun-19 19:23:00 UTC 1 hrs 7 mins 6ac0ee9d318833bd509848c54fad01d82171df84 Success 8910381224002125296
Monday, 17-Jun-19 18:14:53 UTC 1 hrs 17 mins c5b0c00ff269578402fb996c8197b007bad03a9a Success 8910386101691456656
Monday, 17-Jun-19 16:57:23 UTC 31 mins 29 secs 2ce90ba8b245dde76232a3597fdcf6c038af63c4 Failed 8910388091076104400 Step('upload build results.upload storage-sparse size') (retcode: 1)
Monday, 17-Jun-19 16:25:43 UTC 1 hrs 18 mins d13b0cb0823498af9c28c0ac30d9b80cb9893b1c Success 8910393093833340992
Monday, 17-Jun-19 13:26:04 UTC 1 hrs 703b75245ab0905dd4a0acfc39015feeb55bdb30 Success 8910403405039176048
Monday, 17-Jun-19 11:54:56 UTC 1 hrs 1 mins 062d53aad73ef798791968c34b5c6edf77412bb8 Success 8910409656843438288
Monday, 17-Jun-19 08:04:24 UTC 1 hrs 4 mins fa42746fa66f1020be4add64d7548b496226125d Success 8910425124936591152
Monday, 17-Jun-19 05:00:46 UTC 1 hrs 8 mins 19e0540e5ae9080074dab9ef6adf406113a4b327 Success 8910435562092079376
Sunday, 16-Jun-19 19:07:20 UTC 1 hrs 10 mins d57e41f0772f5292dc847de067dc10fc9f724761 Success 8910474263039018336
Sunday, 16-Jun-19 02:41:25 UTC 1 hrs 6 mins 5f8dfeea9b6caccbd79b0dd99e2cd03a76a6f04f Success 8910536079919569392
Sunday, 16-Jun-19 00:49:11 UTC 1 hrs 12 mins d9a6ce65d305613d02a1fc8fdc57058d7484bff5 Success 8910542211940767216
Saturday, 15-Jun-19 23:36:05 UTC 1 hrs 5 mins 777dd45f37126033811dac4503b80f1bfecb2b53 Failed 8910547225560555616 1 out of 9 aggregated steps failed: Timed out after 1800 seconds. Last 10 lines of output:
test dev_auth_provider::tests::test_get_app_firebase_token ... ok
test dev_auth_provider::tests::test_get_persistent_credential ... ok
test dev_auth_provider::tests::test_revoke_app_or_persistent_credential ... ok

test result: ok. 5 passed; 0 failed; 0 ignored; 0 measured; 0 filtered out

PASSED: /pkgfs/packages/identity_bin_unittests/0/test/dev_auth_provider_bin_test passed
DEBUG: stopping or rebooting the node "jam-tutor-plank-yelp"
ERROR: command timed out after 30m0s
Saturday, 15-Jun-19 20:19:05 UTC 1 hrs 32058d292fe5adadd277b1750c5e0b9375df4b2f Success 8910559554159706576
Saturday, 15-Jun-19 19:00:22 UTC 1 hrs 6 mins 1a585ac8eb8f0320d68ee8a2fbce3112fe952940 Success 8910563818448188400
Saturday, 15-Jun-19 11:56:02 UTC 1 hrs 5 mins 2d96a5b88e00300898dffd27d04d26b3ff1e9b3d Success 8910590458451005040
Saturday, 15-Jun-19 09:26:12 UTC 1 hrs 3 mins c3194b6c2d92125a513383816d5ffeac30a4ac44 Success 8910601142738765888
Saturday, 15-Jun-19 07:59:20 UTC 1 hrs 7 mins b2da0f73cc6a0f069457bec2de5d3b9c935fd2fc Success 8910607347314110864
Saturday, 15-Jun-19 06:20:45 UTC 1 hrs 8 mins 2a504b3676a28afe0bee2c512e69244b9bd65699 Success 8910613788999149344
Saturday, 15-Jun-19 04:38:21 UTC 1 hrs 4 mins 8a10704397f02a32f304cc4011a4fd8eb28321c9 Success 8910619618340344032
Friday, 14-Jun-19 22:23:08 UTC 1 hrs 10 mins 5c844895d3e877243eba545b0ab8f0f95404c0b3 Success 8910641858024892272
Friday, 14-Jun-19 21:12:13 UTC 1 hrs 8 mins 7fb766e31f3ceccf8e60dc0bd3a941bcda6110f7 Success 8910646429176748064
Friday, 14-Jun-19 19:59:35 UTC 1 hrs 3 mins 3d28bb17be5bfc33c67126543ff2ee38b497983c Success 8910650441338307920
Friday, 14-Jun-19 18:55:48 UTC 1 hrs 1 mins 42ac25b8655d37470e164aa42ad79c6f014b9cee Success 8910654347673261712
Friday, 14-Jun-19 17:53:44 UTC 1 hrs 2 mins bcd31c85a91dad8f57a7349dae198cea87ed82da Success 8910658284095425664
Friday, 14-Jun-19 16:48:41 UTC 4 mins 53 secs 67e33abb8a4fe7ce3e46c5e617130e05bda8e9a9 Failed 8910658762469154368 Step('build.build fuchsia.gn gen') (retcode: 1)
Friday, 14-Jun-19 16:42:58 UTC 5 mins 39 secs a962d100c5290368f4e86605b213b5cbdfb0e5fe Failed 8910659160464501680 Step('build.build fuchsia.gn gen') (retcode: 1)
Friday, 14-Jun-19 16:37:08 UTC 5 mins 49 secs 5680f4b7d54f1718bfc02551bc2e52804fb03661 Failed 8910659540887831936 Step('build.build fuchsia.gn gen') (retcode: 1)
Friday, 14-Jun-19 16:31:11 UTC 5 mins 15 secs 5298b104dbc7a216989eba595ff469d86e25a27d Failed 8910659878417147840 Step('build.build fuchsia.gn gen') (retcode: 1)
Friday, 14-Jun-19 16:25:48 UTC 1 hrs 5 mins fa8bf50f7a757e910226535c836f4010e9b81c9c Success 8910664015518087200
Friday, 14-Jun-19 15:20:00 UTC 1 hrs 5 mins e76aa2c58d180bc05c3e6e82adddbc1aeed96a18 Success 8910668935917267376
Friday, 14-Jun-19 14:01:46 UTC 59 mins 53 secs eee65b664dd63b702cd80d084a8032b0f3fa23ba Failed 8910672733930699312 1 out of 9 aggregated steps failed: Timed out after 1546 seconds. Last 10 lines of output:
[06633.381] 03666.04380> ahci: txn time out on port 2 txn 0x2984fd48a5e0
[06638.393] 03666.04380> ahci: txn time out on port 2 txn 0x2984fd48f040
[06643.399] 03666.04380> ahci: txn time out on port 2 txn 0x2984fd48e320
Error: Failed to launch log listener: 0Error: Could not open syslog file: /data/infra/testrunnerruntests/syslog.txt.
2019/06/14 13:55:37 Process exited with status 255
not ok 275 //peridot/bin/basemgr:session_context_impl_unittest (15.019340441s)
[06648.400] 03666.04380> ahci: txn time out on port 2 txn 0x2984fd48f4a0
[06653.412] 03666.04380> ahci: txn time out on port 2 txn 0x2984fd48a5e0
DEBUG: stopping or rebooting the node "jam-savor-plank-alien"
Friday, 14-Jun-19 13:01:28 UTC 1 hrs 4 mins 5726c98f514dbddae2ee53502a4808209080fda9 Success 8910677989335641632
Friday, 14-Jun-19 11:37:58 UTC 1 hrs 7 mins 8033efef96d6c1bcaf1ccb61c55cc88702efd743 Success 8910682827612985392
Friday, 14-Jun-19 10:21:00 UTC 1 hrs 5 mins c8950bcdc0dc24173372ad5ff52a9637d73229f4 Success 8910686983048013648
Friday, 14-Jun-19 09:14:56 UTC 1 hrs 7 mins 1e009b462b9e906b4139257044dc1cac69a7ffe4 Success 8910692294442165600
Friday, 14-Jun-19 07:50:34 UTC 1 hrs 3 mins 2f753687e07c6fb0dd1f3d4fa0d17f1a680fd04f Success 8910697250189343456
Friday, 14-Jun-19 04:47:39 UTC 1 hrs c871aa8216003e4aaf54f31f8373d5b09251a8c1 Success 8910707627664514128
Friday, 14-Jun-19 03:45:24 UTC 1 hrs 20 mins 367e12c9a4edf56223246614e19c376b185ec9b8 Success 8910712977552983920
Friday, 14-Jun-19 02:21:46 UTC 1 hrs 13 mins 017cc0bda8f4ec8412cc32232b5ed16523c40fab Success 8910717583422432560
Friday, 14-Jun-19 01:08:32 UTC 1 hrs 6 mins 51c1cc1eea51d4a1d4aa736e1c1791101054e368 Success 8910721781724962000
Friday, 14-Jun-19 00:01:52 UTC 1 hrs 7 mins 760585aa961d569d86b5dd69d372c644267785dc Failed 8910726032044254432 1 out of 9 aggregated steps failed: Timed out after 1800 seconds. Last 10 lines of output:
test dev_auth_provider::tests::test_revoke_app_or_persistent_credential ... ok

test result: ok. 5 passed; 0 failed; 0 ignored; 0 measured; 0 filtered out

PASSED: /pkgfs/packages/identity_bin_unittests/0/test/dev_auth_provider_bin_test passed

SUMMARY: Ran 1 tests: 0 failed (0.135 sec)
ok 321 //src/identity/bin:dev_auth_provider_bin_test (6.63582336s)
DEBUG: stopping or rebooting the node "jam-tutor-plank-yelp"
Thursday, 13-Jun-19 22:54:15 UTC 1 hrs 3 mins efd65f62ec9db4e6560ba6316e40e0f474b6462d Success 8910730047374526384
Thursday, 13-Jun-19 21:50:31 UTC 1 hrs 9 mins 053eb0e8f9bb4ec7a904662ceafee6e7a540213e Success 8910734469248973744
Thursday, 13-Jun-19 20:40:13 UTC 1 hrs 8 mins 7d286efdf874969d7ea8308f36743ba484472916 Success 8910738825136778544
Thursday, 13-Jun-19 19:30:58 UTC 57 mins 19 secs 9816640273a365fff5e30f6ff27c0732dcb479f3 Failed 8910742441711271424
Thursday, 13-Jun-19 18:33:28 UTC 1 hrs 4 mins 855cf936cc3065446bc215bc8e5e146670ebbc41 Success 8910746496482363568
Thursday, 13-Jun-19 17:29:02 UTC 1 hrs 3 mins 646a0c599df15f619252434a50a9916421cbf00d Success 8910750485424691536
Thursday, 13-Jun-19 16:25:39 UTC 1 hrs 19 mins a2a225c9b2a89286a92ad5405bf189bcf42bf296 Success 8910756263307208096
Thursday, 13-Jun-19 14:53:49 UTC 1 hrs 2 mins a99584f37d35bb11ef6cced3a70d721ad6c620a4 Success 8910762568920368464
Thursday, 13-Jun-19 13:13:36 UTC 1 hrs b4d9f7fb23143d98924d62a86ed31b15d57eed13 Success 8910768319691499136
Thursday, 13-Jun-19 11:42:11 UTC 1 hrs 7 mins b6af93912a116888dcc21e3a67b28edb2ec8ab8c Success 8910774583895828848
Thursday, 13-Jun-19 10:02:34 UTC 1 hrs 5 mins a49bd0dc3c7809c9e58c6f60fc17d0ae142a69db Success 8910780818394742336
Thursday, 13-Jun-19 08:23:26 UTC 1 hrs 8 mins 54e61e62797d4a9975af03ece92e1efc63bf8867 Success 8910786678607764592
Thursday, 13-Jun-19 06:50:20 UTC 1 hrs 9 mins 78ed8779922a0b28b463d280976f68057c14b4c1 Success 8910791591565576336
Thursday, 13-Jun-19 05:32:17 UTC 1 hrs c23235a26d54699313b0694ab0a45cb7e5d882fe Success 8910796949722268256
Thursday, 13-Jun-19 03:59:07 UTC 1 hrs 5 mins c31cade0cc09a2f594424e1e735304e9fa923b5a Failed 8910801992927593984 1 out of 9 aggregated steps failed: Timed out after 1800 seconds. Last 10 lines of output:
test identifiers::tests::test_ord ... ok

test result: ok. 8 passed; 0 failed; 0 ignored; 0 measured; 0 filtered out

PASSED: /pkgfs/packages/identity_lib_unittests/0/test/account_common_lib_test passed

SUMMARY: Ran 1 tests: 0 failed (0.120 sec)
ok 322 //src/identity/lib:account_common_lib_test (6.535318722s)
DEBUG: stopping or rebooting the node "jam-tutor-plank-yelp"
Thursday, 13-Jun-19 00:30:07 UTC 1 hrs 6 mins 11faff7914d6e708278b10b1851d6972b0ce97db Success 8910814813695634112
Wednesday, 12-Jun-19 23:23:09 UTC 1 hrs 4 mins 2fda52ba2fbb88a769d1df0415e14deb27ffe1df Failed 8910818895160847296 1 out of 9 aggregated steps failed: Timed out after 1800 seconds. Last 10 lines of output:
[02561.898] 11570.11582> [11570:11582:20190612,232009.211413:ERROR scoped_task_suspend.cc:35] zx_task_suspend: ZX_ERR_BAD_STATE (-20)
[02561.898] 11570.11582> [11570:11582:20190612,232009.211742:ERROR memory_map_fuchsia.cc:47] zx_object_get_info ZX_INFO_PROCESS_MAPS: ZX_ERR_BAD_STATE (-20)
[02561.898] 11570.11582> [11570:11582:20190612,232009.211881:ERROR process_memory_fuchsia.cc:50] zx_process_read_memory: ZX_ERR_NO_MEMORY (-4)
[02561.898] 11570.11582> [11570:11582:20190612,232009.211900:ERROR process_reader_fuchsia.cc:148] read link_map
[02561.898] 11570.11582> [11570:11582:20190612,232009.211922:ERROR crash_report_exception_handler.cc:131] zx_object_get_info ZX_INFO_THREAD_EXCEPTION_REPORT: ZX_ERR_BAD_STATE (-20)
[02561.898] 11570.11582> [11570:11582:20190612,232009.212203:ERROR filesystem_posix.cc:79] stat /tmp/crashes/pending/aaaaaaaa-aaaa-aaaa-aaaa-aaaaaaaaaaaa.dmp: No such file or directory (2)
[02561.899] 11570.11582> [11570:11582:20190612,232009.212546:ERROR file_io_posix.cc:148] open /tmp/crashes/completed/64e55fde-fb8c-4e91-93c6-259bc4a30d0d.lock: File exists (17)
[02561.909] 01228.01344> failed to get exception report for [9160764.9160778] : error -20
DEBUG: stopping or rebooting the node "swear-moan-plank-poker"
Wednesday, 12-Jun-19 22:18:19 UTC 1 hrs 2 mins 7f4511672744e502114a1db49edd9f3479f3584a Success 8910823322156738832
Wednesday, 12-Jun-19 21:07:51 UTC 1 hrs 2 mins 9ab388fbd5cb35472879406ff7e18baf8979ce45 Success 8910827846002124960
Wednesday, 12-Jun-19 19:56:00 UTC 1 hrs 9 mins 746512fd5207c41457d2715a8f7afeff06f84762 Success 8910832542875292848
Wednesday, 12-Jun-19 18:41:23 UTC 1 hrs 12 mins 9157f6d7a77ae1447cf4612d663789187dec0ad8 Success 8910837685736089088
Wednesday, 12-Jun-19 17:19:36 UTC 1 hrs 4 mins a97ebf99680c5066e0b9b1731f8546f0929cef65 Success 8910841773721355616
Wednesday, 12-Jun-19 16:14:32 UTC 1 hrs 8 mins 5308f8d7241d43cdd1a86904b248c50be377de34 Success 8910846294431298944
Wednesday, 12-Jun-19 15:02:43 UTC 1 hrs 1 mins 3ffc98ca8021ca4b771f1a0246cd33b3e55325e0 Success 8910852316001989520
Wednesday, 12-Jun-19 13:26:59 UTC 1 hrs 8 mins bd1c4948849d6439cafdf89357eb0243ca0a5f14 Success 8910858440297666320
Wednesday, 12-Jun-19 11:49:46 UTC 1 hrs 3 mins cbcb02030cfc12e6975e89c866cdc791875dd989 Success 8910863691360955184
Wednesday, 12-Jun-19 10:26:12 UTC 1 hrs 4f594ee091f3104056be60fe458fce95efbd3d06 Success 8910868059561119760
Wednesday, 12-Jun-19 08:34:52 UTC 1 hrs 7 mins ea3ad71105ef060340d9308d9ae23a18415e3462 Failed 8910878013583440224 Test failure(s): //src/ledger:ledger_unittests
Wednesday, 12-Jun-19 06:38:38 UTC 1 hrs 1eaa2a9e1a4c754deab2baca9c366abe45006bb0 Success 8910884926344766496
Wednesday, 12-Jun-19 04:48:45 UTC 1 hrs 3 mins 8ed4237d39d50a0409e04a1ff3a8b591cafad91b Success 8910892558518961424
Wednesday, 12-Jun-19 02:47:25 UTC 1 hrs 8 mins d644b0a54da11fcd83455fec0552f1d2a9cbd571 Success 8910896888933386688
Wednesday, 12-Jun-19 01:31:35 UTC 1 hrs 5 mins f72ae75df2af9339479aa6140d84ba2efd28b67e Success 8910901478393547856
Wednesday, 12-Jun-19 00:25:39 UTC 1 hrs 17 mins 1edd9a749b4733ee34917c348bfdc6a3c1287a8b Success 8910906513321501200
Tuesday, 11-Jun-19 23:05:38 UTC 1 hrs 1 mins c40c96a12aaaaebea336f7dad0ddb39a36ca9791 Success 8910910433562916512
Tuesday, 11-Jun-19 22:03:20 UTC 1 hrs 7 mins 955441bf70bad9fd1ffac83755b73dbab5bfa2fb Success 8910914692543180384
Tuesday, 11-Jun-19 20:55:38 UTC 20 mins 10 secs 67962cd49f8d258f4c014b6ad6b4431167e827a8 Failed 8910915970543430192 Step('build.build fuchsia.ninja.fuchsia') (retcode: 1)
Tuesday, 11-Jun-19 20:35:20 UTC 22 mins 35 secs 1e42be6de77d2dfc3995f253ac9dd4229edf1c45 Failed 8910917404264599136 Step('build.build fuchsia.ninja.fuchsia') (retcode: 1)
Tuesday, 11-Jun-19 20:12:28 UTC 1 hrs 1 mins d9a90d966d00d8afc39346bf28a5e6343051b398 Failed 8910921307879919040 1 out of 8 aggregated steps failed: Timed out after 1550 seconds. Last 10 lines of output:
DEBUG: stopping or rebooting the node "viral-query-clock-agent"
[01652.986] 10925.10937> [ERROR:garnet/bin/sshd-host/service.cc(164)] Error from chrealm: Could not open hub in realm: /hub
[01652.987] 10925.10937> [ERROR:garnet/bin/sshd-host/service.cc(164)] Error from chrealm: Could not open hub in realm: /hub
[01652.988] 10925.10937> [ERROR:garnet/bin/sshd-host/service.cc(164)] Error from chrealm: Could not open hub in realm: /hub
[01652.989] 10925.10937> [ERROR:garnet/bin/sshd-host/service.cc(164)] Error from chrealm: Could not open hub in realm: /hub
[01652.990] 10925.10937> [ERROR:garnet/bin/sshd-host/service.cc(164)] Error from chrealm: Could not open hub in realm: /hub
[01652.991] 10925.10937> [ERROR:garnet/bin/sshd-host/service.cc(164)] Error from chrealm: Could not open hub in realm: /hub
[01652.992] 10925.10937> [ERROR:garnet/bin/sshd-host/service.cc(164)] Error from chrealm: Could not open hub in realm: /hub
[01652.993] 10925.10937> [ERROR:garnet/bin/sshd-host/service.cc(164)] Error from chrealm: Could not open hub in realm: /hub
Tuesday, 11-Jun-19 19:10:27 UTC 1 hrs 2 mins 5dd7ac54a5002aa13f8268604b1b114175128416 Success 8910925242041807888
Tuesday, 11-Jun-19 18:07:59 UTC 1 hrs 2 mins b6fadb95e3b3daa29fe44587ba53b33516646834 Infra Failure 8910929163712566224 recipe infra failure: Uncaught Exception: KeyError('pkgfs/packages/agent_services_tests/0/test/agent_services_test/stdout-and-stderr.txt',)
Tuesday, 11-Jun-19 17:05:34 UTC 1 hrs 4 mins d82b412470eabe613120a260f84d45e9a990f04f Success 8910933259070018096
Tuesday, 11-Jun-19 16:00:32 UTC 1 hrs 7 mins aab9d85e4464fc392eeae8603a1f0427aaa6b2cf Success 8910939096857394128
Tuesday, 11-Jun-19 14:27:45 UTC 1 hrs 6 mins 5b33b263349f3d98dc7c8a997d854f756969e842 Success 8910945147861046384
Tuesday, 11-Jun-19 12:51:33 UTC 59 mins 53 secs 74f3787336c6df3f1ad6117a1672a7183e08e2d4 Failed 8910950039004643072 1 out of 8 aggregated steps failed: Timed out after 1429 seconds. Last 10 lines of output:
[01186.914] 05740:05755> [ERROR:garnet/bin/sysmgr/app.cc(185)] Singleton fuchsia-pkg://fuchsia.com/pkg_resolver#meta/pkg_resolver.cmx died
[01186.936] 05740:05755> [ERROR:garnet/bin/sysmgr/app.cc(185)] Singleton fuchsia-pkg://fuchsia.com/wlancfg#meta/wlancfg.cmx died
[01186.938] 05740:05755> [ERROR:garnet/bin/sysmgr/app.cc(185)] Singleton fuchsia-pkg://fuchsia.com/netstack#meta/netstack.cmx died
[01186.950] 05740:05755> [ERROR:garnet/bin/sysmgr/app.cc(185)] Singleton fuchsia-pkg://fuchsia.com/amber#meta/amber.cmx died
[01186.958] 08897:08915> Error: ErrorMessage { msg: "FIDL server future exited unexpectedly" }
[01186.959] 05740:05755> [ERROR:garnet/bin/sysmgr/app.cc(185)] Singleton fuchsia-pkg://fuchsia.com/mdns#meta/mdns.cmx died
[01186.975] 12003:12015> Error: ErrorMessage { msg: "stream of watcher channels has ended unexpectedly" }
[01186.987] 11308:11512> log exporter: Failed: -24 (ZX_ERR_PEER_CLOSED).
[01187.014] 05740:05755> [ERROR:garnet/bin/sysmgr/package_updating_loader.cc(109)] Package resolver error handler triggered, marking as needing reconnect. status=-24
Tuesday, 11-Jun-19 11:33:47 UTC 1 hrs 5 mins 8754242af9eed0cd62110214c869d49f804abf77 Success 8910954474673613200
Tuesday, 11-Jun-19 10:23:10 UTC 1 hrs 2 mins 5b9ed1e30c99ca0febf9771489275468236e20b3 Success 8910960133901860064
Tuesday, 11-Jun-19 08:25:40 UTC 1 hrs aad4766c5f1f85e4431880c4f1a137dd79f63502 Failed 8910965682586616160 Test failure(s): /pkgfs/packages/omaha_client_lib_tests/0/test/omaha_client_lib_test
Tuesday, 11-Jun-19 07:25:10 UTC 1 hrs 1d9994a6e3a8a7d3fb3d6f921e4730ce81cff4c9 Success 8910970455342582960
Tuesday, 11-Jun-19 06:09:16 UTC 1 hrs 3 mins a3a269f7ec5ddd6e66ff51109de7c3436f373124 Success 8910975038379006048
Tuesday, 11-Jun-19 04:56:28 UTC 1 hrs 6 mins 5f3fe641d1ff149993b95a8d35d4ddb8066c777e Success 8910980662622709504
Tuesday, 11-Jun-19 03:27:04 UTC 1 hrs 2 mins 3e6611e14e9f5e162d39f2e8f37a0940e1fc95f6 Failed 8910984928481857040 1 out of 9 aggregated steps failed: Timed out after 1800 seconds. Last 10 lines of output:
[04433.839] 02202.8142498> wlantap phy: unbinding device because the channel was closed
[04433.839] 02202.8142498> wlantap phy: done unbinding
[04433.852] 02202.8171981> wlan: [I] exiting MainLoop
[04433.857] 12310.12322> wlanstack::device [I]: phy removed: #4
[04433.864] 09651.09663> wlancfg got event: OnPhyRemoved { phy_id: 4 }
[04433.864] 09651.09663> wlancfg: phy removed: 4
[04433.875] 09651.09663> wlancfg: Client station state machine for iface #4 terminated with an error: Server closed the ConnectTransaction channel before sending a response
[04433.875] 09651.09663> wlancfg: Removed client station for iface #4
[04433.875] 09651.09663> Did not receive a connect result
Tuesday, 11-Jun-19 02:19:15 UTC 1 hrs 6 mins 8c0b345c54e8b7138de8717b3e9204bc7dd93387 Infra Failure 8910989106276589056 recipe infra failure: Uncaught Exception: KeyError('pkgfs/packages/modular_integration_tests/0/test/story_shell_factory_test/stdout-and-stderr.txt',)
Tuesday, 11-Jun-19 01:12:52 UTC 1 hrs 8 mins 6018f495cb5ddc5be509308eb04a99eade65fcda Failed 8910993537342005456 Test failure(s): /pkgfs/packages/bluetooth-tests/0/test/bt-integration-tests, /pkgfs/packages/omaha_client_lib_tests/0/test/omaha_client_lib_test
Tuesday, 11-Jun-19 00:02:26 UTC 58 mins 37 secs 16397520858ae74863096b90271270e8290e0244 Failed 8910997232374260240 Test failure(s): /pkgfs/packages/omaha_client_lib_tests/0/test/omaha_client_lib_test
Monday, 10-Jun-19 23:03:43 UTC 1 hrs 4 mins 14f500745177002714fe1c74e65c858b01ce25bc Failed 8911001369329814608 Test failure(s): /pkgfs/packages/omaha_client_lib_tests/0/test/omaha_client_lib_test
Monday, 10-Jun-19 21:57:52 UTC 1 hrs 5 mins 62060695884f4f0bb9b5fb3af7148b1045696015 Success 8911005727664358944
Monday, 10-Jun-19 20:48:36 UTC 1 hrs 8 mins c753e656511de935af1c98c1bcbd83e615fa98ff Success 8911010037556534752
Monday, 10-Jun-19 19:40:11 UTC 1 hrs 9 mins a85d854d48cfa932d9a6fc3a3d766075eebf7833 Success 8911014440747769696
Monday, 10-Jun-19 18:30:07 UTC 1 hrs 6 mins a3b728dee62c4e9ab1d74b6cdf065e464227d017 Success 8911018619185191296
Monday, 10-Jun-19 17:23:47 UTC 1 hrs 1 mins 9d75600adbdcf8c6c95245e82681fec75f9676aa Success 8911022467390552224
Monday, 10-Jun-19 16:22:36 UTC 1 hrs 11 mins ceee8885c5419887cf056572e9ce00b2c0f6ffed Success 8911027026416820016
Monday, 10-Jun-19 07:14:31 UTC 1 hrs 5 mins 51ccaf88a967dbda5db579c9254e53e71abc430b Success 8911061078326702304
Monday, 10-Jun-19 05:38:08 UTC 1 hrs 4 mins bc05a5b3b743ea9ac76bc80bc14c0eb7168347dd Success 8911067102678352688
Monday, 10-Jun-19 04:33:09 UTC 1 hrs 02332190e20eb0a393512cb82f76e5367adab142 Success 8911071999342143504
Monday, 10-Jun-19 01:22:15 UTC 1 hrs 5 mins 67343d8e646758ae2e3d227f78beaf9cdc3f63ca Success 8911083297987177456
Monday, 10-Jun-19 00:07:01 UTC 1 hrs 1 mins 03892c39655b954819ef23f06740c2a32b9fe13f Infra Failure 8911087745984466592 recipe infra failure: Uncaught Exception: KeyError('pkgfs/packages/modular_integration_tests/0/test/module_context_test/stdout-and-stderr.txt',)
Sunday, 09-Jun-19 23:05:01 UTC 1 hrs 4 mins cd7404a30d8a85241d72e0426f4eddac3d6ddb03 Success 8911091887468342016
Sunday, 09-Jun-19 20:46:04 UTC 1 hrs 9 mins 18a5435cf0fcb4edf403ac64fd4ed660e09c3034 Success 8911100933128342272
Sunday, 09-Jun-19 11:54:13 UTC 1 hrs 1 mins fb6e481589a4d0d17c64042d993d5db532b4330f Success 8911133834729314896
Sunday, 09-Jun-19 06:36:29 UTC 1 hrs 3 mins 7ffb1df148e8fadd05597db3760d7cead750cf21 Success 8911154953596302352
Sunday, 09-Jun-19 00:02:01 UTC 58 mins 51 secs 1a436e7f8ee3a6bdf33f4b6f7337465be4cae753 Success 8911179519862326816
Saturday, 08-Jun-19 21:33:36 UTC 58 mins 56 secs 9dc702bc4ec80538eab1c7ca58ba1ed5b9d08909 Success 8911187813741289264
Saturday, 08-Jun-19 20:34:28 UTC 1 hrs 2 mins 1ba7c9f8fa0f98a7f3dae68a929309946280ca4c Failed 8911192990347760096 1 out of 9 aggregated steps failed: Timed out after 1800 seconds. Last 10 lines of output:
test identifiers::tests::test_ord ... ok

test result: ok. 8 passed; 0 failed; 0 ignored; 0 measured; 0 filtered out

PASSED: /pkgfs/packages/identity_lib_unittests/0/test/account_common_lib_test passed

SUMMARY: Ran 1 tests: 0 failed (0.315 sec)
ok 318 //src/identity/lib:account_common_lib_test (6.663847076s)
DEBUG: stopping or rebooting the node "jam-tutor-plank-yelp"
Saturday, 08-Jun-19 16:27:54 UTC 1 hrs 5 mins 509060490f21e38f4bd24c4da85bbf20d1326fca Success 8911208490614909824
Saturday, 08-Jun-19 15:05:45 UTC 59 mins 56 secs 763208dcc18a43279b6f53e3c8bb272adae674a6 Success 8911213134137431184
Saturday, 08-Jun-19 13:51:58 UTC 1 hrs 5 mins 563b93bcc960de91b6dd4a717aa0357a01d2cca9 Success 8911217299051804688
Saturday, 08-Jun-19 11:51:31 UTC 1 hrs 5 mins 2404254159d445efe6c88b0e289b1423835c2104 Success 8911224851107134096
Saturday, 08-Jun-19 10:30:14 UTC 1 hrs 6 mins b4a8623a1c22df2046732672f9b84c3e14223463 Success 8911230018904932528
Saturday, 08-Jun-19 09:06:27 UTC 1 hrs 4 mins 121e1a480e94757380b660f6d9720416ef7cdbbb Failed 8911235684892636768 1 out of 9 aggregated steps failed: Timed out after 1800 seconds. Last 10 lines of output:
test error::tests::test_create_error ... ok
test error::tests::test_result_ext ... ok
test error::tests::test_with_cause ... ok
test auth_provider::tests::test_revoke_app_or_persistent_credential ... ok

test result: ok. 8 passed; 0 failed; 0 ignored; 0 measured; 0 filtered out

PASSED: /pkgfs/packages/identity_bin_unittests/0/test/google_auth_provider_rust_bin_test passed
DEBUG: stopping or rebooting the node "jam-tutor-plank-yelp"
Saturday, 08-Jun-19 07:27:16 UTC 1 hrs 6 mins 93461f2869b162a13bfc270cf6145d2a03b06564 Success 8911241506164687520
Saturday, 08-Jun-19 06:21:00 UTC 59 mins 35 secs 22cf1c97bb3b189551a22851d154ecac134a82a4 Success 8911246216927902704
Saturday, 08-Jun-19 05:06:11 UTC 49 mins 24 secs 9713c0caaf385e2a12a40db0a56eb533f4bb0bf9 Failed 8911249872178730352
Saturday, 08-Jun-19 04:08:03 UTC 1 hrs 1 mins 5abc17e991caf8ac05ac30b3c613756ff8c332da Failed 8911255081769904080 1 out of 9 aggregated steps failed: Timed out after 954 seconds. Last 10 lines of output:
[00711.959] 05080:05105> [WARNING:garnet/bin/appmgr/service_provider_dir_impl.cc(127)] Component fuchsia-pkg://fuchsia.com/no_pkg_resolver_test#meta/no_pkg_resolver_test.cmx is not allowed to connect to fuchsia.pkg.PackageResolver because this servi
[00711.959] 05080:05105> ce is not present in the component's sandbox.
[00711.959] 05080:05105> Refer to https://fuchsia.googlesource.com/fuchsia/+/master/docs/the-book/sandboxing.md#services for more information.
[00712.000] 11178:11193> PASSED: /pkgfs/packages/no_pkg_resolver_test/0/test/no_pkg_resolver_test passed
[00712.065] 11178:11193>
[00712.065] 11178:11193> ------------------------------------------------
[00712.065] 11178:11193> RUNNING TEST: /pkgfs/packages/routing_integration_test/0/test/routing_integration_test
[00712.065] 11178:11193>
[00712.425] 825956:825968> [component_manager] INFO: Component manager is starting up...
Saturday, 08-Jun-19 02:45:18 UTC 1 hrs 5 mins f3d79d00423bd5bea27a599c95466890b1152397 Success 8911259192839703456
Saturday, 08-Jun-19 01:39:57 UTC 1 hrs 3 mins 350bff8eef77cbfc8a481c066e423c15671909b7 Failed 8911263174617951760 2 out of 7 aggregated steps failed: Timed out after 952 seconds. Last 10 lines of output:
[00687.015] 05106:05123> [WARNING:garnet/bin/appmgr/service_provider_dir_impl.cc(127)] Component fuchsia-pkg://fuchsia.com/no_pkg_resolver_test#meta/no_pkg_resolver_test.cmx is not allowed to connect to fuchsia.pkg.PackageResolver because this servi
[00687.015] 05106:05123> ce is not present in the component's sandbox.
[00687.015] 05106:05123> Refer to https://fuchsia.googlesource.com/fuchsia/+/master/docs/the-book/sandboxing.md#services for more information.
[00687.076] 11188:11206> PASSED: /pkgfs/packages/no_pkg_resolver_test/0/test/no_pkg_resolver_test passed
[00687.132] 11188:11206>
[00687.132] 11188:11206> ------------------------------------------------
[00687.132] 11188:11206> RUNNING TEST: /pkgfs/packages/routing_integration_test/0/test/routing_integration_test
[00687.132] 11188:11206>
[00687.453] 808939:808954> [component_manager] INFO: Component manager is starting up...
, Timed out after 1794 seconds. Last 10 lines of output:
[01683.551] 06245.06257> [ERROR:garnet/bin/sysmgr/app.cc(185)] Singleton fuchsia-pkg://fuchsia.com/mdns#meta/mdns.cmx died
[01683.562] 06245.06257> [ERROR:garnet/bin/sysmgr/app.cc(185)] Singleton fuchsia-pkg://fuchsia.com/amber#meta/amber.cmx died
[01683.573] 06245.06257> [ERROR:garnet/bin/sysmgr/app.cc(185)] Singleton fuchsia-pkg://fuchsia.com/wlancfg#meta/wlancfg.cmx died
[01683.573] 06245.06257> [ERROR:garnet/bin/sysmgr/app.cc(185)] Singleton fuchsia-pkg://fuchsia.com/netstack#meta/netstack.cmx died
log exporter: Failed: -24 (ZX_ERR_PEER_CLOSED).
[01683.596] 09645.09659> Error: ErrorMessage { msg: "FIDL server future exited unexpectedly" }
[01683.597] 06245.06257> [ERROR:garnet/bin/sysmgr/package_updating_loader.cc(109)] Package resolver error handler triggered, marking as needing reconnect. status=-24
[01683.621] 12346.12358> Error: ErrorMessage { msg: "stream of watcher channels has ended unexpectedly" }
DEBUG: stopping or rebooting the node "july-shady-copy-spiny"
Saturday, 08-Jun-19 00:36:40 UTC 1 hrs 10 mins 10b494b67de620ba5a80258f0db1af21ceeb0f50 Failed 8911267593697052768 1 out of 8 aggregated steps failed: Timed out after 901 seconds. Last 10 lines of output:
[00653.968] 05051:05086> [WARNING:garnet/bin/appmgr/service_provider_dir_impl.cc(127)] Component fuchsia-pkg://fuchsia.com/no_pkg_resolver_test#meta/no_pkg_resolver_test.cmx is not allowed to connect to fuchsia.pkg.PackageResolver because this servi
[00653.968] 05051:05086> ce is not present in the component's sandbox.
[00653.968] 05051:05086> Refer to https://fuchsia.googlesource.com/fuchsia/+/master/docs/the-book/sandboxing.md#services for more information.
[00654.023] 11279:11300> PASSED: /pkgfs/packages/no_pkg_resolver_test/0/test/no_pkg_resolver_test passed
[00654.066] 11279:11300>
[00654.066] 11279:11300> ------------------------------------------------
[00654.066] 11279:11300> RUNNING TEST: /pkgfs/packages/routing_integration_test/0/test/routing_integration_test
[00654.066] 11279:11300>
[00654.336] 889816:889828> [component_manager] INFO: Component manager is starting up...
Friday, 07-Jun-19 23:26:27 UTC 1 hrs 6 mins baaf445787393bef60522763b3fe904cc5080bbe Success 8911271806264332448
Friday, 07-Jun-19 22:19:30 UTC 1 hrs 3 mins c7757d0675ddfd7e041ca40824985958d3b18f2d Success 8911275797685919728
Friday, 07-Jun-19 21:16:02 UTC 1 hrs 2 mins a2b1db3129c36b7e77fee0ec3ea695f82681fb50 Success 8911279887721892256
Friday, 07-Jun-19 20:10:54 UTC 1 hrs 2 mins c1b055e0ba9f7fafa147d8fb1845d00ad647e558 Infra Failure 8911283839815270784 recipe infra failure: Uncaught Exception: KeyError('pkgfs/packages/sessionctl_integration_tests/0/test/sessionctl_test/stdout-and-stderr.txt',)
Friday, 07-Jun-19 19:08:11 UTC 1 hrs 11 mins abf65a29974b65527cf7a10e0349a4de2f5355ba Failed 8911288461422437152 Test failure(s): //src/connectivity/network/netstack/link/bridge:netstack_link_bridge_test
Friday, 07-Jun-19 17:54:44 UTC 58 mins 47 secs 6fc3e8598d126eed4815bcae992e890ccf94ed3d Failed 8911292171144459648 Test failure(s): //src/connectivity/network/netstack/link/bridge:netstack_link_bridge_test
Friday, 07-Jun-19 16:55:43 UTC 1 hrs 3 mins f3458a5b8d86b73b44adbe39659827f42c226178 Failed 8911296206848179248 Test failure(s): //src/connectivity/network/netstack/link/bridge:netstack_link_bridge_test
Friday, 07-Jun-19 15:51:36 UTC 1 hrs 4ad9b4e55984a0a2471ba37e17b0a167b6b560f3 Failed 8911301120565600576 Test failure(s): //src/connectivity/network/netstack/link/bridge:netstack_link_bridge_test
Friday, 07-Jun-19 14:02:54 UTC 16 mins 9 secs c0a77d9a70e1c15bae446d88d099eb96522d7756 Failed 8911305420763357616 Step('build.build fuchsia.ninja.fuchsia') (retcode: 1)
Friday, 07-Jun-19 13:15:00 UTC 1 hrs aec8a0551b87bddbf952ed267426fff641701dbe Failed 8911312019839284160 Test failure(s): //src/connectivity/network/netstack/link/bridge:netstack_link_bridge_test
Friday, 07-Jun-19 11:40:17 UTC 57 mins 41 secs 1621a654a78fa9bb6a8d82a20a4c8fa62a0869d0 Failed 8911317802907657248 Test failure(s): //src/connectivity/network/netstack/link/bridge:netstack_link_bridge_test
Friday, 07-Jun-19 10:08:20 UTC 1 hrs 1 mins eefdae9787dd01f5d5bd040ed09b15f2ca639833 Success 8911324111655705728
Friday, 07-Jun-19 08:28:05 UTC 1 hrs 4 mins ff23a98aa57283652e924f1a8c62e60c0218df8a Success 8911330410320544320
Friday, 07-Jun-19 06:47:57 UTC 1 hrs 4 mins 1cb0c8d14eb92bdab33c16287de322d387895c67 Success 8911338191911077104
Friday, 07-Jun-19 04:44:19 UTC 1 hrs 5 mins 217dab5078eed93074ccd5cc6a3d9ac44acf9484 Success 8911343983503335920
Friday, 07-Jun-19 03:03:19 UTC 1 hrs 6 mins bae2e8092a2de6cfba780e3a519151ac6eff4cf3 Success 8911348734781931184
Friday, 07-Jun-19 01:10:01 UTC 15 mins 11 secs ef110aed74237fed2800f0d236bb598b6565edfc Failed 8911352688470507968 Step('build.build fuchsia.ninja.fuchsia') (retcode: 1)
Friday, 07-Jun-19 00:33:06 UTC 14 mins 37 secs 3f0373e4968e7dc49d8827b575c0cfbc46927b05 Failed 8911354952707154944 Step('build.build fuchsia.ninja.fuchsia') (retcode: 1)
Friday, 07-Jun-19 00:17:52 UTC 18 mins 38 secs 8626611a4f7294a7eb03ce5169bcece46fb6a571 Failed 8911356244047792000 Step('build.build fuchsia.ninja.fuchsia') (retcode: 1)
Thursday, 06-Jun-19 23:57:24 UTC 15 mins 33 secs d2687c8aaf2b6a922ecb8164849e7c4e388bbac7 Failed 8911357281890596592 Step('build.build fuchsia.ninja.fuchsia') (retcode: 1)
Thursday, 06-Jun-19 23:40:54 UTC 17 mins 31 secs 600315e923326ff1eaf078bcc7ec0d1914a3e741 Failed 8911358444110420656 Step('build.build fuchsia.ninja.fuchsia') (retcode: 1)
Thursday, 06-Jun-19 23:22:23 UTC 57 mins 29 secs 5367330c2e7c87132c4049f67df6191ff09c4e90 Success 8911362304083304736
Thursday, 06-Jun-19 22:21:01 UTC 1 hrs 2 mins 409cb840e3efba603f076848c7492ae484d0f9ed Success 8911366269652745136
Thursday, 06-Jun-19 21:18:00 UTC 1 hrs 6 mins d02b85dd4dc9e12c7863443877f8ea1e61a47ad2 Success 8911370473496424896
Thursday, 06-Jun-19 20:05:54 UTC 1 hrs 13 mins e438a9d09973a36a21f177506742435fa621260e Success 8911375453409220320
Thursday, 06-Jun-19 08:32:36 UTC 56 mins 30 secs dee03d0b90752a026d3f97eeb543d3777e7fc6a0 Success 8911419663133740768
Thursday, 06-Jun-19 07:09:15 UTC 56 mins 40 secs b6fde278c8a6ab05f15252adbd2e047a857c2840 Success 8911424893893716672
Thursday, 06-Jun-19 05:46:12 UTC 1 hrs 1 mins 7eddecad5b16847003be228e7fa9f7a5271e5f4c Success 8911428794955274192
Thursday, 06-Jun-19 04:44:12 UTC 58 mins 15 secs 1b2d4f705f5c0812434c0cfa1718bec0ef506130 Success 8911434476209189696
Thursday, 06-Jun-19 03:13:54 UTC 55 mins 42 secs 6c8afe562576b6bf6fcf0be03c6085990462998f Failed 8911438579325816272 Test failure(s): /pkgfs/packages/modular_integration_tests/0/test/story_shell_embedded_mod_test
Thursday, 06-Jun-19 02:08:39 UTC 57 mins 57 secs 2c3f4dcb669722ce01bab605a95e640c933d68f1 Success 8911442305082562096
Thursday, 06-Jun-19 01:09:26 UTC 1 hrs 12 mins bb343ad7da03837ca3dfde6e6af45ff2ed2d266b Success 8911446847534240784
Wednesday, 05-Jun-19 23:57:15 UTC 1 hrs 2 mins 842c4a2e0f7fe6b29f087302f29fafe358b890c8 Success 8911450793254690448
Wednesday, 05-Jun-19 22:54:30 UTC 1 hrs 1 mins dc0dd46673f77cc9d04d4f4096bb6a6a5d8a77fd Success 8911454708038921456
Wednesday, 05-Jun-19 21:52:17 UTC 1 hrs 1 mins faa09cb813bfae8378a8e4a728cd898c3dee4470 Failed 8911458601763721760 1 out of 9 aggregated steps failed: Timed out after 1800 seconds. Last 10 lines of output:

[----------] Global test environment tear-down
[==========] 8 tests from 2 test suites ran. (4 ms total)
[ PASSED ] 8 tests.
PASSED: /pkgfs/packages/wlan_drivers_tests/0/test/wlan_minstrel_unittest passed

SUMMARY: Ran 1 tests: 0 failed (0.153 sec)
ok 291 //src/connectivity/wlan/drivers/wlan:wlan_minstrel_unittest (7.386278166s)
DEBUG: stopping or rebooting the node "bless-candy-copy-sneak"
Wednesday, 05-Jun-19 20:50:21 UTC 59 mins 11 secs 56b012e28ef9cc4bf6d0ee52e8a0b9ac57d449bd Success 8911462387632526752
Wednesday, 05-Jun-19 19:50:16 UTC 1 hrs 6 mins f4f55040f9f01a6e510cd49351070388ba27dfdd Success 8911466862871089424
Wednesday, 05-Jun-19 18:39:09 UTC 1 hrs 2 mins c9f7af76537c274a32ba63c87245372b9b96713f Success 8911470811442611648
Wednesday, 05-Jun-19 17:36:23 UTC 1 hrs 1 mins 7630d4d2b658e16b71beb67625ab464a49a15a75 Success 8911474667602386128
Wednesday, 05-Jun-19 16:35:02 UTC 1 hrs 17 mins 93e4862d17c4b9e9a138ab8a1978a95beea0afae Success 8911479567121551936
Wednesday, 05-Jun-19 15:17:11 UTC 58 mins 48 secs e848233961a2bb7a150d689a8013f90aa09324d8 Success 8911484792902508496
Wednesday, 05-Jun-19 13:54:05 UTC 1 hrs 3 mins 7dc339542fdec0eb2543397d42591433d3850a56 Success 8911490826497776768
Wednesday, 05-Jun-19 12:18:13 UTC 1 hrs 3 mins b9b1c065cf03bff2a5c7c8e571abacd7e09041c5 Success 8911496135461985344
Wednesday, 05-Jun-19 10:53:48 UTC 58 mins 45 secs 5a74da8ed4bdfae5fac79a814f45b132fa7aa705 Success 8911501768876203664
Wednesday, 05-Jun-19 09:24:19 UTC 59 mins 27 secs 1a8421778af252c73aacf19076410a3c80bd0ec5 Success 8911506894288730144
Wednesday, 05-Jun-19 08:02:49 UTC 1 hrs 3 mins c0bba2813e820a4efc20681e57056f2881b6467d Success 8911512076417799200
Wednesday, 05-Jun-19 05:53:33 UTC 1 hrs 3 mins 584d2bae0add8afb4a43e7fc495ec590b0c6ab81 Success 8911519921341757024
Wednesday, 05-Jun-19 04:35:47 UTC 1 hrs 1 mins 598aeccbaab5c1488a72b52d79cb58a91a16f507 Success 8911524638101456944
Wednesday, 05-Jun-19 03:20:48 UTC 56 mins 48 secs ffa68a70d92243ae5e1b08ea3958e4b5044cab23 Success 8911528757354629680
Wednesday, 05-Jun-19 02:15:19 UTC 1 hrs 4 mins b3099baf2e433f3c1450a07ac232e27a97ab3ed0 Success 8911532805282826800
Wednesday, 05-Jun-19 01:10:54 UTC 1 hrs 11 mins 4bc346d00e376e4942445e54b51c25429c4e74e3 Success 8911537325724984896
Tuesday, 04-Jun-19 23:59:10 UTC 59 mins 52 secs e42f99816ee07e6054cb58646ab601d7bc7d1107 Success 8911541122384426256
Tuesday, 04-Jun-19 22:58:45 UTC 59 mins 9 secs 0576e881fd32ec6b21032f85a116e349edc14e07 Success 8911544857002211952
Tuesday, 04-Jun-19 21:59:24 UTC 1 hrs 30 mins 5efe49a1aac3eae74c2fa609481f45526925458e Infra Failure 8911550889783993648
Tuesday, 04-Jun-19 20:23:28 UTC 1 hrs 10 mins 449d644800ac068d0991a4395adaef47ff58fa0f Success 8911555371876974736
Tuesday, 04-Jun-19 19:12:18 UTC 1 hrs 16 mins b6b9a5e2a87c84edfaa630155a6fd939040ce243 Success 8911560214319796368
Tuesday, 04-Jun-19 17:55:15 UTC 1 hrs 7 mins 9ea34671ffd57e2b7de974e9e739162761a416e7 Failed 8911564464445686640 Test failure(s): //peridot/tests:/b/s/w/ir/k/peridot/tests/run_modular_tests.sh
Tuesday, 04-Jun-19 16:47:49 UTC 1 hrs 2 mins f92d3d4a9dba0c207a212fdc8b018ebed0440ae9 Failed 8911568406119945232 1 out of 9 aggregated steps failed: Timed out after 1800 seconds. Last 10 lines of output:
[ RUN ] ProbeSequenceTest.RandomSequence
[ OK ] ProbeSequenceTest.RandomSequence (1 ms)
[----------] 1 test from ProbeSequenceTest (1 ms total)

[----------] Global test environment tear-down
[==========] 8 tests from 2 test suites ran. (4 ms total)
[ PASSED ] 8 tests.
PASSED: /pkgfs/packages/wlan_drivers_tests/0/test/wlan_minstrel_unittest passed
DEBUG: stopping or rebooting the node "bless-candy-copy-sneak"
Tuesday, 04-Jun-19 15:45:08 UTC 1 hrs 4 mins 52ca8201347a131f562e9144a46362f167d2b50a Success 8911573478291720464
Tuesday, 04-Jun-19 14:17:24 UTC 1 hrs 4 mins 4927563a4e94ab02770a7d6cb611a2cf5c3f31be Success 8911578369956289568
Tuesday, 04-Jun-19 13:06:41 UTC 1 hrs 1 mins 35bd480b72d255c5cf5c15f2a702e560b863da01 Success 8911584047439517264
Tuesday, 04-Jun-19 11:36:26 UTC 1 hrs 1 mins b3b6d1aa706a3da20572864733c58f23a2ca6a27 Failed 8911589223518818016 Test failure(s): /pkgfs/packages/modular_tests/0/test/run_modular_tests.sh
Tuesday, 04-Jun-19 10:14:13 UTC 1 hrs 5 mins 235a0605f9c42b8232e946d2a6d15bdd1054052b Success 8911594865522035760
Tuesday, 04-Jun-19 08:44:31 UTC 1 hrs 2 mins 1464149f25089292e639cbb2cd7d0c279ed3062f Failed 8911600131218655840 Test failure(s): //peridot/tests:/b/s/w/ir/k/peridot/tests/run_modular_tests.sh
Tuesday, 04-Jun-19 07:20:49 UTC 1 hrs 5 mins 242cc2be8def62725f0ef2f4ffe77069cf9ab0f2 Failed 8911606360993118752 1 out of 9 aggregated steps failed: Timed out after 1800 seconds. Last 10 lines of output:
test log::tests::test_log_inspect_bytes ... ok
test log::tests::test_log_option ... ok
test nodes::tests::test_time_metadata_format ... ok
test nodes::list::tests::test_bounded_list_node ... ok

test result: ok. 11 passed; 0 failed; 0 ignored; 0 measured; 0 filtered out

PASSED: /pkgfs/packages/wlan-inspect-tests/0/test/wlan_inspect_lib_test passed
DEBUG: stopping or rebooting the node "bless-candy-copy-sneak"
Tuesday, 04-Jun-19 05:41:52 UTC 57 mins 15 secs 040937d375b5749f01539f1ba05ed00f05fc7d30 Success 8911611371071279936
(Show: default 25 50 100 200 ) Next