Home | Search | fuchsia - Builders
Login

Builder fuchsia-arm64-debug-vim2

Machine Pool

Idle36
Busy14
Offline0
50 bots
NameStatusLast Seen
fuchsia-ci-16-us-central1-b-0-s1jt Idle Sunday, 16-Jun-19 22:48:46 UTC
fuchsia-ci-16-us-central1-b-1-3v8w Idle Sunday, 16-Jun-19 22:48:39 UTC
fuchsia-ci-16-us-central1-b-10-zell Busy Sunday, 16-Jun-19 22:49:08 UTC
fuchsia-ci-16-us-central1-b-11-zmxt Idle Sunday, 16-Jun-19 22:49:21 UTC
fuchsia-ci-16-us-central1-b-12-kpgm Idle Sunday, 16-Jun-19 22:49:11 UTC
fuchsia-ci-16-us-central1-b-13-d8cl Busy Sunday, 16-Jun-19 22:49:00 UTC
fuchsia-ci-16-us-central1-b-14-fpum Busy Sunday, 16-Jun-19 22:49:23 UTC
fuchsia-ci-16-us-central1-b-15-kvdb Idle Sunday, 16-Jun-19 22:49:04 UTC
fuchsia-ci-16-us-central1-b-16-khvb Idle Sunday, 16-Jun-19 22:48:36 UTC
fuchsia-ci-16-us-central1-b-17-3uew Busy Sunday, 16-Jun-19 22:49:20 UTC
fuchsia-ci-16-us-central1-b-18-ryq8 Idle Sunday, 16-Jun-19 22:48:42 UTC
fuchsia-ci-16-us-central1-b-19-mlrq Idle Sunday, 16-Jun-19 22:49:21 UTC
fuchsia-ci-16-us-central1-b-2-qc2k Idle Sunday, 16-Jun-19 22:47:34 UTC
fuchsia-ci-16-us-central1-b-20-tavb Busy Sunday, 16-Jun-19 22:49:11 UTC
fuchsia-ci-16-us-central1-b-21-pcob Idle Sunday, 16-Jun-19 22:49:11 UTC
fuchsia-ci-16-us-central1-b-22-qmfz Idle Sunday, 16-Jun-19 22:49:12 UTC
fuchsia-ci-16-us-central1-b-23-qyhn Idle Sunday, 16-Jun-19 22:48:56 UTC
fuchsia-ci-16-us-central1-b-24-m4x4 Idle Sunday, 16-Jun-19 22:49:11 UTC
fuchsia-ci-16-us-central1-b-3-k32p Idle Sunday, 16-Jun-19 22:49:10 UTC
fuchsia-ci-16-us-central1-b-4-yyd4 Idle Sunday, 16-Jun-19 22:48:39 UTC
fuchsia-ci-16-us-central1-b-5-ogdh Busy Sunday, 16-Jun-19 22:49:16 UTC
fuchsia-ci-16-us-central1-b-6-asgp Idle Sunday, 16-Jun-19 22:49:04 UTC
fuchsia-ci-16-us-central1-b-7-0z4x Idle Sunday, 16-Jun-19 22:49:17 UTC
fuchsia-ci-16-us-central1-b-8-lxtq Idle Sunday, 16-Jun-19 22:48:33 UTC
fuchsia-ci-16-us-central1-b-9-iggc Idle Sunday, 16-Jun-19 22:48:38 UTC
fuchsia-ci-16-us-central1-c-0-6xxo Idle Sunday, 16-Jun-19 22:49:18 UTC
fuchsia-ci-16-us-central1-c-1-npj8 Idle Sunday, 16-Jun-19 22:49:15 UTC
fuchsia-ci-16-us-central1-c-10-qvj5 Idle Sunday, 16-Jun-19 22:49:07 UTC
fuchsia-ci-16-us-central1-c-11-9s0i Busy Sunday, 16-Jun-19 22:49:22 UTC
fuchsia-ci-16-us-central1-c-12-1kth Idle Sunday, 16-Jun-19 22:49:21 UTC
fuchsia-ci-16-us-central1-c-13-bqj2 Idle Sunday, 16-Jun-19 22:48:34 UTC
fuchsia-ci-16-us-central1-c-14-gixg Idle Sunday, 16-Jun-19 22:48:42 UTC
fuchsia-ci-16-us-central1-c-15-d1qw Idle Sunday, 16-Jun-19 22:49:12 UTC
fuchsia-ci-16-us-central1-c-16-ivii Busy Sunday, 16-Jun-19 22:49:02 UTC
fuchsia-ci-16-us-central1-c-17-dw9t Idle Sunday, 16-Jun-19 22:48:48 UTC
fuchsia-ci-16-us-central1-c-18-vc40 Idle Sunday, 16-Jun-19 22:49:03 UTC
fuchsia-ci-16-us-central1-c-19-9fmy Idle Sunday, 16-Jun-19 22:49:23 UTC
fuchsia-ci-16-us-central1-c-2-npdg Busy Sunday, 16-Jun-19 22:48:59 UTC
fuchsia-ci-16-us-central1-c-20-bq6x Busy Sunday, 16-Jun-19 22:49:20 UTC
fuchsia-ci-16-us-central1-c-21-25ol Idle Sunday, 16-Jun-19 22:49:26 UTC
fuchsia-ci-16-us-central1-c-22-b15e Idle Sunday, 16-Jun-19 22:49:02 UTC
fuchsia-ci-16-us-central1-c-23-cxr0 Busy Sunday, 16-Jun-19 22:49:01 UTC
fuchsia-ci-16-us-central1-c-24-hs1w Idle Sunday, 16-Jun-19 22:48:41 UTC
fuchsia-ci-16-us-central1-c-3-1zb5 Busy Sunday, 16-Jun-19 22:49:06 UTC
fuchsia-ci-16-us-central1-c-4-puwu Idle Sunday, 16-Jun-19 22:48:38 UTC
fuchsia-ci-16-us-central1-c-5-c6hv Idle Sunday, 16-Jun-19 22:49:26 UTC
fuchsia-ci-16-us-central1-c-6-qzyv Busy Sunday, 16-Jun-19 22:49:00 UTC
fuchsia-ci-16-us-central1-c-7-oxs5 Idle Sunday, 16-Jun-19 22:48:48 UTC
fuchsia-ci-16-us-central1-c-8-c6sm Idle Sunday, 16-Jun-19 22:48:58 UTC
fuchsia-ci-16-us-central1-c-9-6umz Busy Sunday, 16-Jun-19 22:49:01 UTC

No current builds

No Pending Build Requests

Builder groups

Recent Builds:

Finished Time Run Duration Revision Result Build #Info
Sunday, 16-Jun-19 18:07:10 UTC 30 mins 50 secs d57e41f0772f5292dc847de067dc10fc9f724761 Infra Failure 8910474275882251728 recipe infra failure: Uncaught Exception: AssertionError()
Sunday, 16-Jun-19 16:13:01 UTC 31 mins 22 secs Infra Failure 8910481470673692096 recipe infra failure: Uncaught Exception: AssertionError()
Sunday, 16-Jun-19 01:56:53 UTC 43 mins 4 secs 5f8dfeea9b6caccbd79b0dd99e2cd03a76a6f04f Infra Failure 8910536087339260800 recipe infra failure: Uncaught Exception: AssertionError()
Saturday, 15-Jun-19 23:30:15 UTC 27 mins 55 secs d9a6ce65d305613d02a1fc8fdc57058d7484bff5 Infra Failure 8910545450415147360 recipe infra failure: Uncaught Exception: AssertionError()
Saturday, 15-Jun-19 22:44:35 UTC 27 mins 42 secs 777dd45f37126033811dac4503b80f1bfecb2b53 Infra Failure 8910547233364107504 recipe infra failure: Uncaught Exception: AssertionError()
Saturday, 15-Jun-19 19:07:38 UTC 27 mins 41 secs 32058d292fe5adadd277b1750c5e0b9375df4b2f Infra Failure 8910562078286554112 recipe infra failure: Uncaught Exception: AssertionError()
Saturday, 15-Jun-19 18:20:20 UTC 27 mins 13 secs 1a585ac8eb8f0320d68ee8a2fbce3112fe952940 Infra Failure 8910563819718800560 recipe infra failure: Uncaught Exception: AssertionError()
Saturday, 15-Jun-19 11:17:42 UTC 27 mins 44 secs 2d96a5b88e00300898dffd27d04d26b3ff1e9b3d Infra Failure 8910590461137797920 recipe infra failure: Uncaught Exception: AssertionError()
Saturday, 15-Jun-19 08:17:03 UTC 29 mins 43 secs c3194b6c2d92125a513383816d5ffeac30a4ac44 Infra Failure 8910603598878093072 recipe infra failure: Uncaught Exception: AssertionError()
Saturday, 15-Jun-19 07:01:14 UTC 27 mins 2 secs b2da0f73cc6a0f069457bec2de5d3b9c935fd2fc Infra Failure 8910609126710488240 recipe infra failure: Uncaught Exception: AssertionError()
Saturday, 15-Jun-19 05:47:26 UTC 27 mins 5 secs 2a504b3676a28afe0bee2c512e69244b9bd65699 Infra Failure 8910613344997389744 recipe infra failure: Uncaught Exception: AssertionError()
Saturday, 15-Jun-19 04:45:28 UTC 28 mins 17 secs 9ba78c5f38cdfcc94d2881b1e2b49dab51010e60 Infra Failure 8910617337629576112 recipe infra failure: Uncaught Exception: AssertionError()
Saturday, 15-Jun-19 03:42:00 UTC 28 mins 7 secs 8a10704397f02a32f304cc4011a4fd8eb28321c9 Infra Failure 8910619622452057216 recipe infra failure: Uncaught Exception: AssertionError()
Friday, 14-Jun-19 20:42:43 UTC 26 mins 29 secs 5c844895d3e877243eba545b0ab8f0f95404c0b3 Infra Failure 8910645392586005952 recipe infra failure: Uncaught Exception: AssertionError()
Friday, 14-Jun-19 20:16:04 UTC 28 mins 13 secs 022cfca4f56b5fad4d6d94f0b7df2966fc63adc7 Infra Failure 8910647288973224912 recipe infra failure: Uncaught Exception: AssertionError()
Friday, 14-Jun-19 19:45:55 UTC 26 mins 59 secs 3d28bb17be5bfc33c67126543ff2ee38b497983c Infra Failure 8910648995608585536 recipe infra failure: Uncaught Exception: AssertionError()
Friday, 14-Jun-19 19:18:46 UTC 30 mins 23 secs 67b0304c90a0a6b50cc6c8eaf616bbe05218d549 Infra Failure 8910650919007019136 recipe infra failure: Uncaught Exception: AssertionError()
Friday, 14-Jun-19 18:48:14 UTC 30 mins 19 secs 2fccc817659d0300dd00fdc38efe1b035ef92a7c Infra Failure 8910652838042739728 recipe infra failure: Uncaught Exception: AssertionError()
Friday, 14-Jun-19 18:17:44 UTC 27 mins 42ac25b8655d37470e164aa42ad79c6f014b9cee Infra Failure 8910654546240957072 recipe infra failure: Uncaught Exception: AssertionError()
Friday, 14-Jun-19 17:50:34 UTC 28 mins 18 secs 601a0d6d37ede9e75f2ac793c61fa33578162eb5 Infra Failure 8910656336318922480 recipe infra failure: Uncaught Exception: AssertionError()
Friday, 14-Jun-19 17:22:06 UTC 30 mins 25 secs bcd31c85a91dad8f57a7349dae198cea87ed82da Infra Failure 8910658278584348816 recipe infra failure: Uncaught Exception: AssertionError()
Friday, 14-Jun-19 16:49:40 UTC 5 mins 55 secs 67e33abb8a4fe7ce3e46c5e617130e05bda8e9a9 Failed 8910658765449693728 Step('build.build fuchsia.gn gen') (retcode: 1)
Friday, 14-Jun-19 16:42:21 UTC 5 mins 33 secs a962d100c5290368f4e86605b213b5cbdfb0e5fe Failed 8910659194117417216 Step('build.build fuchsia.gn gen') (retcode: 1)
Friday, 14-Jun-19 16:36:42 UTC 5 mins 2 secs 5680f4b7d54f1718bfc02551bc2e52804fb03661 Failed 8910659520182308960 Step('build.build fuchsia.gn gen') (retcode: 1)
Friday, 14-Jun-19 16:31:32 UTC 5 mins 57 secs 5298b104dbc7a216989eba595ff469d86e25a27d Failed 8910659902468258128 Step('build.build fuchsia.gn gen') (retcode: 1)
(Show: default 25 50 100 200 ) Next