Home | Search | dart - Builders
Login

Builder vm-kernel-mac-debug-x64

Machine Pool

Idle1
Busy13
Offline0
14 bots
NameStatusLast Seen
build3-m9 Busy Wednesday, 26-Jun-19 16:45:02 UTC
build4-m9 Busy Wednesday, 26-Jun-19 16:45:24 UTC
build5-m9 Busy Wednesday, 26-Jun-19 16:45:03 UTC
build6-m9 Busy Wednesday, 26-Jun-19 16:45:10 UTC
vm15-m9 Busy Wednesday, 26-Jun-19 16:45:07 UTC
vm16-m9 Busy Wednesday, 26-Jun-19 16:45:31 UTC
vm17-m9 Busy Wednesday, 26-Jun-19 16:45:13 UTC
vm18-m9 Busy Wednesday, 26-Jun-19 16:45:07 UTC
vm19-m9 Busy Wednesday, 26-Jun-19 16:45:03 UTC
vm20-m9 Busy Wednesday, 26-Jun-19 16:45:05 UTC
vm21-m9 Busy Wednesday, 26-Jun-19 16:45:22 UTC
vm22-m9 Busy Wednesday, 26-Jun-19 16:45:13 UTC
vm23-m9 Idle Wednesday, 26-Jun-19 16:45:30 UTC
vm24-m9 Busy Wednesday, 26-Jun-19 16:45:18 UTC

Current Builds (1):

No Pending Build Requests

Builder groups

Recent Builds:

Finished Time Run Duration Revision Result Build #Info
Wednesday, 26-Jun-19 15:44:04 UTC 1 hrs 6 mins 722b8391118c701e1df4327b90ed37c1724f855e Failed 2504 1 out of 2 aggregated steps failed: 1 out of 1 aggregated steps failed: Step('test results') (retcode: 1)
Wednesday, 26-Jun-19 14:10:03 UTC 56 mins 1 secs b17cc1f9437bf26b7813e3febe1c3fd9ca49e88f Failed 2503 1 out of 2 aggregated steps failed: 1 out of 1 aggregated steps failed: Step('test results') (retcode: 1)
Wednesday, 26-Jun-19 13:13:38 UTC 42 mins 58 secs b75057b6876cfa03696309c7a9ca3e2788896f34 Infra Failure 2502 could not read recipe result file at "/b/s/w/ir/tmp/recipe-result.json": open /b/s/w/ir/tmp/recipe-result.json: no such file or directory
Wednesday, 26-Jun-19 11:43:19 UTC 58 mins 55 secs 9e3b44b29978021d77a1e94823e272b2e8a52db1 Success 2501
Wednesday, 26-Jun-19 10:20:57 UTC 55 mins 30 secs 603293f92a6e101c4977572eb7f31792736dae94 Success 2500
Wednesday, 26-Jun-19 01:11:54 UTC 31 mins 58 secs 523aa97ea1dd50041463a28768ac08cd69d48a69 Success 2499
Wednesday, 26-Jun-19 00:25:14 UTC 42 mins 7b39dede0e546df1bab87ba666383f081d334e0c Success 2498
Tuesday, 25-Jun-19 23:24:04 UTC 34 mins 28 secs 75a4e0b89acd88edee04572978658cbbc148eaff Success 2497
Tuesday, 25-Jun-19 22:47:21 UTC 49 mins 38 secs e7d235d8383dfff795cf5f5b475b50af7e58277d Success 2496
Tuesday, 25-Jun-19 21:40:43 UTC 35 mins 18 secs 177f543fa81520185125f7200d747661b000fb2a Success 2495
Tuesday, 25-Jun-19 20:56:25 UTC 29 mins 7 secs 11d369fd58b0c7f9b8f5bf23155b8a6d760e89e1 Success 2494
Tuesday, 25-Jun-19 20:27:10 UTC 41 mins 9 secs 3e732e5bbe85270cd9864e3600aa68f5f09efda6 Success 2493
Tuesday, 25-Jun-19 19:10:11 UTC 29 mins 38 secs bb42e9dad348315e75a93f0614915f0d0cdb3c5a Infra Failure 2492 recipe infra failure: Uncaught Exception: TypeError('an integer is required',)
Tuesday, 25-Jun-19 18:25:59 UTC 39 mins 21 secs dd862e7933080aa2b85d91a510fa4a0d84c18e5b Success 2491
Tuesday, 25-Jun-19 17:38:35 UTC 32 mins 2 secs 9de3e7c5361a96da49457b9bc1c80ae6a1fd254e Success 2490
Tuesday, 25-Jun-19 16:30:41 UTC 30 mins 42 secs 7a028cd924e42e1294c94817dbd25cbdfd432586 Infra Failure 2489 recipe infra failure: Uncaught Exception: TypeError('an integer is required',)
Tuesday, 25-Jun-19 15:28:46 UTC 42 mins 49 secs c9c614db6ac1c451ae95dc7f25afa7c1d98ae1db Success 2488
Tuesday, 25-Jun-19 14:35:06 UTC 31 mins 29 secs 829910f86e1443d3e6cbc073c5552af227491d1a Success 2487
Tuesday, 25-Jun-19 13:46:45 UTC 34 mins 48 secs a80b3279a977278c47c1026c836d3107b7b19907 Success 2486
Tuesday, 25-Jun-19 12:59:34 UTC 29 mins 43 secs 3e3ce804c9c2e132979567c98f29ebac9659a885 Success 2485
Tuesday, 25-Jun-19 12:29:35 UTC 1 hrs 4 mins 1a97ed32b4595b5adecf1f8d390c16e2bf26f658 Failed 2484 1 out of 3 aggregated steps failed: 1 out of 1 aggregated steps failed: Step('test results') (timeout)
Tuesday, 25-Jun-19 11:11:59 UTC 52 mins 9 secs 6e77e52dbd433cf5e4f34b0d90190ff562c24e05 Success 2483
Tuesday, 25-Jun-19 08:58:22 UTC 54 mins 7 secs de72f2f1bd864c74434cc93882052f66198f5f8b Infra Failure 2482 recipe infra failure: Uncaught Exception: TypeError('an integer is required',)
Tuesday, 25-Jun-19 01:52:59 UTC 54 mins 25 secs 5c1d5444d66a254f9c31c692d8f312d8de33149e Success 2481
Monday, 24-Jun-19 23:56:54 UTC 35 mins 34 secs 006fd0cfab8e74b14a20e902691f217208b6f489 Success 2480
(Show: default 25 50 100 200 ) Next