Home | Search | chromium - Builders
Login

Builder win_angle_x64_rel_ng Build 22 Microsoft Windows

Results:

Internal Failure

Trigger Info:

Projectchromium
PatchGerrit CL 1330310 (ps#1)

Execution:

Steps and Logfiles:

Show:
  1. ( 545 ms ) setup_build
    running recipe: "chromium_trybot"
  2. ( 461 ms ) report builders
     
    running tester 'Win7 FYI x64 Release (NVIDIA)' on master 'chromium.gpu.fyi' against builder 'GPU FYI Win x64 Builder' on master 'chromium.gpu.fyi'
  3. ( 5 secs ) taskkill
  4. ( 6 mins 16 secs ) bot_update
    [68GB/299GB used (22%)]
  5. ( 1 secs ) swarming.py --version
    0.13
  6. ( 1 secs ) read test spec (chromium.gpu.fyi.json)
    path: C:\b\swarming\w\ir\cache\builder\src\testing\buildbot\chromium.gpu.fyi.json
  7. ( 229 ms ) read filter exclusion spec
    path: 'testing\\buildbot\\trybot_analyze_config.json'
  8. ( 22 secs ) analyze
  9. ( 448 ms ) lookup GN args
     
    build_angle_gles1_conform_tests = true
    dcheck_always_on = true
    ffmpeg_branding = "Chrome"
    internal_gles2_conform_tests = true
    is_component_build = false
    is_debug = false
    proprietary_codecs = true
    strip_absolute_paths_from_debug_symbols = true
    symbol_level = 1
    use_goma = true
    goma_dir = "C:\\b\\swarming\\w\\ir\\cache\\goma\\client"
  10. ( 24 mins 43 secs ) compile (with patch)
  11. ( 1 mins 36 secs ) isolate tests
  12. ( 195 ms ) mark: before_tests
  13. ( 1 secs ) gl_tests on NVIDIA GPU on Windows (with patch) on Windows-2008ServerR2-SP1
    Run on OS: 'Windows-2008ServerR2-SP1'
  14. ( 221 ms ) angle_end2end_tests on NVIDIA GPU on Windows
    TEST RESULTS WERE INVALID
  15. ( 200 ms ) angle_gles1_conformance_tests on NVIDIA GPU on Windows
    TEST RESULTS WERE INVALID
  16. ( 216 ms ) angle_unittests on NVIDIA GPU on Windows
    TEST RESULTS WERE INVALID
  17. ( 216 ms ) angle_white_box_tests on NVIDIA GPU on Windows
    TEST RESULTS WERE INVALID
  18. ( 203 ms ) tab_capture_end2end_tests on NVIDIA GPU on Windows
    TEST RESULTS WERE INVALID
  19. ( 213 ms ) gl_tests on NVIDIA GPU on Windows
    TEST RESULTS WERE INVALID
  20. ( 215 ms ) gl_tests_passthrough on NVIDIA GPU on Windows
    TEST RESULTS WERE INVALID
  21. ( 217 ms ) gl_unittests on NVIDIA GPU on Windows
    TEST RESULTS WERE INVALID
  22. ( 216 ms ) gles2_conform_test on NVIDIA GPU on Windows
    TEST RESULTS WERE INVALID
  23. ( 215 ms ) gles2_conform_d3d9_test on NVIDIA GPU on Windows
    TEST RESULTS WERE INVALID
  24. ( 215 ms ) gles2_conform_gl_test on NVIDIA GPU on Windows
    TEST RESULTS WERE INVALID
  25. ( 216 ms ) gpu_unittests on NVIDIA GPU on Windows
    TEST RESULTS WERE INVALID
  26. ( 200 ms ) context_lost_tests on NVIDIA GPU on Windows
    TEST RESULTS WERE INVALID
  27. ( 216 ms ) depth_capture_tests on NVIDIA GPU on Windows
    TEST RESULTS WERE INVALID
  28. ( 218 ms ) gpu_process_launch_tests on NVIDIA GPU on Windows
    TEST RESULTS WERE INVALID
  29. ( 215 ms ) info_collection_tests on NVIDIA GPU on Windows
    TEST RESULTS WERE INVALID
  30. ( 185 ms ) maps_pixel_test on NVIDIA GPU on Windows
    TEST RESULTS WERE INVALID
  31. ( 216 ms ) pixel_test on NVIDIA GPU on Windows
    TEST RESULTS WERE INVALID
  32. ( 216 ms ) screenshot_sync_tests on NVIDIA GPU on Windows
    TEST RESULTS WERE INVALID
  33. ( 209 ms ) trace_test on NVIDIA GPU on Windows
    TEST RESULTS WERE INVALID
  34. ( 207 ms ) webgl2_conformance_tests on NVIDIA GPU on Windows
    TEST RESULTS WERE INVALID
  35. ( 215 ms ) webgl_conformance_d3d9_tests on NVIDIA GPU on Windows
    TEST RESULTS WERE INVALID
  36. ( 215 ms ) webgl_conformance_tests on NVIDIA GPU on Windows
    TEST RESULTS WERE INVALID
  37. ( 5 secs ) taskkill (2)
  38. ( 58 secs ) bot_update (without patch)
    [69GB/299GB used (23%)]
  39. ( 464 ms ) lookup GN args (2)
     
    build_angle_gles1_conform_tests = true
    dcheck_always_on = true
    ffmpeg_branding = "Chrome"
    internal_gles2_conform_tests = true
    is_component_build = false
    is_debug = false
    proprietary_codecs = true
    strip_absolute_paths_from_debug_symbols = true
    symbol_level = 1
    use_goma = true
    goma_dir = "C:\\b\\swarming\\w\\ir\\cache\\goma\\client"
  40. ( 2 mins 46 secs ) compile (without patch)
  41. ( 16 secs ) isolate tests (2)
  42. ( 1 secs ) video_decode_accelerator_d3d9_unittest on NVIDIA GPU on Windows (without patch) on Windows-2008ServerR2-SP1
    Run on OS: 'Windows-2008ServerR2-SP1'
    Shard duration: 0:01:01.747180
  43. ( 1 secs ) video_decode_accelerator_gl_unittest on NVIDIA GPU on Windows (without patch) on Windows-2008ServerR2-SP1
    Run on OS: 'Windows-2008ServerR2-SP1'
    Shard duration: 0:01:07.335036
  44. ( 4 secs ) angle_end2end_tests on NVIDIA GPU on Windows (without patch) on Windows-2008ServerR2-SP1
    Run on OS: 'Windows-2008ServerR2-SP1'
    Max shard duration: 0:03:23.194057 (shard #3)
    Min shard duration: 0:01:48.825077 (shard #1)
  45. ( 1 secs ) gl_tests_passthrough on NVIDIA GPU on Windows (without patch) on Windows-2008ServerR2-SP1
    Run on OS: 'Windows-2008ServerR2-SP1'
    Shard duration: 34s
  46. ( 1 secs ) gl_tests on NVIDIA GPU on Windows (without patch) on Windows-2008ServerR2-SP1
    Run on OS: 'Windows-2008ServerR2-SP1'
    Shard duration: 45s
  47. ( 1 secs ) gles2_conform_gl_test on NVIDIA GPU on Windows (without patch) on Windows-2008ServerR2-SP1
    Run on OS: 'Windows-2008ServerR2-SP1'
    Shard duration: 0:01:14.313237
  48. ( 4 secs ) angle_unittests on NVIDIA GPU on Windows (without patch) on Windows-2008ServerR2-SP1
    Run on OS: 'Windows-2008ServerR2-SP1'
    Shard duration: 45s
  49. ( 1 secs ) gles2_conform_d3d9_test on NVIDIA GPU on Windows (without patch) on Windows-2008ServerR2-SP1
    Run on OS: 'Windows-2008ServerR2-SP1'
    Shard duration: 0:01:18.807474
  50. ( 3 secs ) gpu_unittests on NVIDIA GPU on Windows (without patch) on Windows-2008ServerR2-SP1
    Run on OS: 'Windows-2008ServerR2-SP1'
    Shard duration: 43s
  51. ( 1 secs ) angle_white_box_tests on NVIDIA GPU on Windows (without patch) on Windows-2008ServerR2-SP1
    Run on OS: 'Windows-2008ServerR2-SP1'
    Shard duration: 26s
  52. ( 1 secs ) angle_gles1_conformance_tests on NVIDIA GPU on Windows (without patch) on Windows-2008ServerR2-SP1
    Run on OS: 'Windows-2008ServerR2-SP1'
    Shard duration: 41s
  53. ( 2 secs ) gl_unittests on NVIDIA GPU on Windows (without patch) on Windows-2008ServerR2-SP1
    Run on OS: 'Windows-2008ServerR2-SP1'
    Shard duration: 22s
  54. ( 2 secs ) gles2_conform_test on NVIDIA GPU on Windows (without patch) on Windows-2008ServerR2-SP1
    Run on OS: 'Windows-2008ServerR2-SP1'
    Shard duration: 0:01:37.342606
  55. ( 212 ms ) angle_unittests on NVIDIA GPU on Windows (retry summary)
     
    Failed with patch, succeeded without patch:
    all initial tests failed
     
  56. ( 195 ms ) depth_capture_tests on NVIDIA GPU on Windows (2)
    TEST RESULTS WERE INVALID
  57. ( 203 ms ) depth_capture_tests on NVIDIA GPU on Windows (retry summary)
     
    Failed with patch, succeeded without patch:
    all initial tests failed
     
  58. ( 197 ms ) pixel_test on NVIDIA GPU on Windows (2)
    TEST RESULTS WERE INVALID
  59. ( 203 ms ) pixel_test on NVIDIA GPU on Windows (retry summary)
     
    Failed with patch, succeeded without patch:
    all initial tests failed
     
  60. ( 200 ms ) gl_tests on NVIDIA GPU on Windows (retry summary)
     
    Failed with patch, succeeded without patch:
    all initial tests failed
     
  61. ( 183 ms ) gpu_unittests on NVIDIA GPU on Windows (retry summary)
     
    Failed with patch, succeeded without patch:
    all initial tests failed
     
  62. ( 201 ms ) hardware_accelerated_feature_tests on NVIDIA GPU on Windows (retry summary)
     
    Failed with patch, succeeded without patch:
    all initial tests failed
     
  63. ( 198 ms ) gl_tests_passthrough on NVIDIA GPU on Windows (retry summary)
     
    Failed with patch, succeeded without patch:
    all initial tests failed
     
  64. ( 204 ms ) angle_white_box_tests on NVIDIA GPU on Windows (retry summary)
     
    Failed with patch, succeeded without patch:
    all initial tests failed
     
  65. ( 198 ms ) angle_end2end_tests on NVIDIA GPU on Windows (retry summary)
     
    Failed with patch, succeeded without patch:
    all initial tests failed
     
  66. ( 198 ms ) gles2_conform_gl_test on NVIDIA GPU on Windows (retry summary)
     
    Failed with patch, succeeded without patch:
    all initial tests failed
     
  67. ( 196 ms ) info_collection_tests on NVIDIA GPU on Windows (2)
    TEST RESULTS WERE INVALID
  68. ( 202 ms ) info_collection_tests on NVIDIA GPU on Windows (retry summary)
     
    Failed with patch, succeeded without patch:
    all initial tests failed
     
  69. ( 200 ms ) video_decode_accelerator_gl_unittest on NVIDIA GPU on Windows (retry summary)
     
    Failed with patch, succeeded without patch:
    all initial tests failed
     
  70. ( 200 ms ) video_decode_accelerator_d3d11_unittest on NVIDIA GPU on Windows (retry summary)
     
    Failed with patch, succeeded without patch:
    all initial tests failed
     
  71. ( 190 ms ) gles2_conform_d3d9_test on NVIDIA GPU on Windows (retry summary)
     
    Failed with patch, succeeded without patch:
    all initial tests failed
     
  72. ( 191 ms ) maps_pixel_test on NVIDIA GPU on Windows (2)
    TEST RESULTS WERE INVALID
  73. ( 202 ms ) maps_pixel_test on NVIDIA GPU on Windows (retry summary)
     
    Failed with patch, succeeded without patch:
    all initial tests failed
     
  74. ( 198 ms ) angle_gles1_conformance_tests on NVIDIA GPU on Windows (retry summary)
     
    Failed with patch, succeeded without patch:
    all initial tests failed
     
  75. ( 198 ms ) context_lost_tests on NVIDIA GPU on Windows (2)
    TEST RESULTS WERE INVALID
  76. ( 201 ms ) context_lost_tests on NVIDIA GPU on Windows (retry summary)
     
    Failed with patch, succeeded without patch:
    all initial tests failed
     
  77. ( 199 ms ) gl_unittests on NVIDIA GPU on Windows (retry summary)
     
    Failed with patch, succeeded without patch:
    all initial tests failed
     
  78. ( 199 ms ) gles2_conform_test on NVIDIA GPU on Windows (retry summary)
     
    Failed with patch, succeeded without patch:
    all initial tests failed
     
  79. ( 195 ms ) tab_capture_end2end_tests on NVIDIA GPU on Windows (2)
    TEST RESULTS WERE INVALID
  80. ( 188 ms ) tab_capture_end2end_tests on NVIDIA GPU on Windows (retry summary)
     
    Failed with patch, succeeded without patch:
    all initial tests failed
     
  81. ( 197 ms ) gpu_process_launch_tests on NVIDIA GPU on Windows (2)
    TEST RESULTS WERE INVALID
  82. ( 204 ms ) gpu_process_launch_tests on NVIDIA GPU on Windows (retry summary)
     
    Failed with patch, succeeded without patch:
    all initial tests failed
     
  83. ( 190 ms ) trace_test on NVIDIA GPU on Windows (2)
    TEST RESULTS WERE INVALID
  84. ( 202 ms ) trace_test on NVIDIA GPU on Windows (retry summary)
     
    Failed with patch, succeeded without patch:
    all initial tests failed
     
  85. ( 7 ms ) video_decode_accelerator_d3d9_unittest on NVIDIA GPU on Windows (retry summary)
     
    Failed with patch, succeeded without patch:
    all initial tests failed
     
  86. ( 208 ms ) screenshot_sync_tests on NVIDIA GPU on Windows (2)
    TEST RESULTS WERE INVALID
  87. ( 203 ms ) screenshot_sync_tests on NVIDIA GPU on Windows (retry summary)
     
    Failed with patch, succeeded without patch:
    all initial tests failed
     
  88. ( 196 ms ) webgl_conformance_tests on NVIDIA GPU on Windows (2)
    TEST RESULTS WERE INVALID
  89. ( 202 ms ) webgl_conformance_tests on NVIDIA GPU on Windows (retry summary)
     
    Failed with patch, succeeded without patch:
    all initial tests failed
     
  90. ( 202 ms ) webgl_conformance_gl_passthrough_tests on NVIDIA GPU on Windows (retry summary)
     
    Failed with patch, succeeded without patch:
    all initial tests failed
     
  91. ( 205 ms ) webgl_conformance_d3d9_passthrough_tests on NVIDIA GPU on Windows (retry summary)
     
    Failed with patch, succeeded without patch:
    all initial tests failed
     
  92. ( 201 ms ) webgl_conformance_vulkan_passthrough_tests on NVIDIA GPU on Windows (retry summary)
     
    Failed with patch, succeeded without patch:
    all initial tests failed
     
  93. ( 198 ms ) webgl_conformance_d3d9_tests on NVIDIA GPU on Windows (2)
    TEST RESULTS WERE INVALID
  94. ( 203 ms ) webgl_conformance_d3d9_tests on NVIDIA GPU on Windows (retry summary)
     
    Failed with patch, succeeded without patch:
    all initial tests failed
     
  95. ( 294 ms ) webgl2_conformance_tests on NVIDIA GPU on Windows (2)
    TEST RESULTS WERE INVALID
  96. ( 280 ms ) webgl2_conformance_tests on NVIDIA GPU on Windows (retry summary)
     
    Failed with patch, succeeded without patch:
    all initial tests failed
     
  97. ( 202 ms ) webgl_conformance_d3d11_validating_tests on NVIDIA GPU on Windows (retry summary)
     
    Failed with patch, succeeded without patch:
    all initial tests failed
     
  98. ( 4 secs ) taskkill (3)
  99. ( 1 mins 9 secs ) bot_update (2)
    [69GB/299GB used (23%)]
  100. ( 433 ms ) lookup GN args (3)
     
    build_angle_gles1_conform_tests = true
    dcheck_always_on = true
    ffmpeg_branding = "Chrome"
    internal_gles2_conform_tests = true
    is_component_build = false
    is_debug = false
    proprietary_codecs = true
    strip_absolute_paths_from_debug_symbols = true
    symbol_level = 1
    use_goma = true
    goma_dir = "C:\\b\\swarming\\w\\ir\\cache\\goma\\client"
  101. ( 1 mins 30 secs ) compile (retry with patch)
  102. ( 15 secs ) isolate tests (3)

Build Properties:

NameValueSource
$recipe_engine/path {"cache_dir": "C:\\b\\swarming\\w\\ir\\cache", "temp_dir": "C:\\b\\swarming\\w\\ir\\tmp\\rt"} setup_build
$recipe_engine/runtime {"is_experimental": false, "is_luci": true} setup_build
blamelist ["jie.a.chen@intel.com"] setup_build
bot_id "swarm797-c4" setup_build
buildbucket {"build": {"bucket": "luci.chromium.try", "created_by": "user:jie.a.chen@intel.com", "created_ts": 1541926935853598, "id": "8930166137269129152", "project": "chromium", "tags": ["buildset:patch/gerrit/chromium-review.googlesource.com/1330310/1", "user_agent:gerrit"]}, "hostname": "cr-buildbucket.appspot.com"} setup_build
buildername "win_angle_x64_rel_ng" setup_build
buildnumber 22 setup_build
mastername "tryserver.chromium.angle" setup_build
patch_gerrit_url "https://chromium-review.googlesource.com" setup_build
patch_issue 1330310 setup_build
patch_project "angle/angle" setup_build
patch_ref "refs/changes/10/1330310/1" setup_build
patch_repository_url "https://chromium.googlesource.com/angle/angle" setup_build
patch_set 1 setup_build
patch_storage "gerrit" setup_build
path_config "generic" setup_build
recipe "chromium_trybot" setup_build
repository "https://chromium.googlesource.com/angle/angle" setup_build
got_angle_revision "50bf0429394d3c1c191922cd45489db442785f75" bot_update
got_buildtools_revision "13a00f110ef910a25763346d6538b60f12845656" bot_update
got_dawn_revision "284f33439871e1ae2556d3ada34b5d1b75a4fb20" bot_update
got_nacl_revision "99673869a3cd8731d924bd32fa486feebfdc6c4f" bot_update
got_revision "c1582e69def506093836a7cc6ba1e9c77c3b7a69" bot_update
got_revision_cp "refs/heads/master@{#607124}" bot_update
got_swarming_client_revision "f78187ab77127de42555afe0ad410bebde6ac6a5" bot_update
got_v8_revision "9d6971eb2913c552f9f43609683e273c0051c6fc" bot_update
got_v8_revision_cp "refs/heads/7.2.293@{#1}" bot_update
got_webrtc_revision "e769ed90c3599a131166d5a61625c1b64318fb91" bot_update
got_webrtc_revision_cp "refs/heads/master@{#25544}" bot_update
subproject_tag "chromium" git diff to analyze patch
swarm_hashes_refs/heads/master(at){#607124}_with_patch {"angle_end2end_tests": "9a03b5e6f6600cb2797c7da0dbe41fc14660073e", "angle_gles1_conformance_tests": "29a8ca87e4a72c80e1b16d2bb3971302335316d6", "angle_unittests": "a733922fbdfa314255b4f903f0ef5389858c0ca8", "angle_white_box_tests": "52f2d290bdcdc25affaf1a0c9012ac459b630180", "browser_tests": "003fd1f720340c3b156e396c249f28b9b2fd95d8", "gl_tests": "e5fc7e5c6fb7f4c9b57dec7343f60a1c9c3be569", "gl_unittests": "9311353bed2637382471ee3d24dd1f8a6465fb6c", "gles2_conform_test": "14536e2c318a570002a9e106e20dc2647d499f90", "gpu_unittests": "992cc8afd56d96150624e8b20cbf5e430902e6b7", "telemetry_gpu_integration_test": "3f778e2fcb12fe90cb5d069c3c72e56ca0038c11", "video_decode_accelerator_unittest": "9788253899c320caa1ad993e7e734b42eb0b271a"} isolate tests
failure_type "INVALID_TEST_RESULTS" webgl_conformance_d3d11_validating_tests on NVIDIA GPU on Windows (with patch) on Windows-2008ServerR2-SP1
failure_type "INVALID_TEST_RESULTS" angle_end2end_tests on NVIDIA GPU on Windows
failure_type "INVALID_TEST_RESULTS" angle_gles1_conformance_tests on NVIDIA GPU on Windows
failure_type "INVALID_TEST_RESULTS" angle_unittests on NVIDIA GPU on Windows
failure_type "INVALID_TEST_RESULTS" angle_white_box_tests on NVIDIA GPU on Windows
failure_type "INVALID_TEST_RESULTS" tab_capture_end2end_tests on NVIDIA GPU on Windows
failure_type "INVALID_TEST_RESULTS" gl_tests on NVIDIA GPU on Windows
failure_type "INVALID_TEST_RESULTS" gl_tests_passthrough on NVIDIA GPU on Windows
failure_type "INVALID_TEST_RESULTS" gl_unittests on NVIDIA GPU on Windows
failure_type "INVALID_TEST_RESULTS" gles2_conform_test on NVIDIA GPU on Windows
failure_type "INVALID_TEST_RESULTS" gles2_conform_d3d9_test on NVIDIA GPU on Windows
failure_type "INVALID_TEST_RESULTS" gles2_conform_gl_test on NVIDIA GPU on Windows
failure_type "INVALID_TEST_RESULTS" gpu_unittests on NVIDIA GPU on Windows
failure_type "INVALID_TEST_RESULTS" video_decode_accelerator_d3d11_unittest on NVIDIA GPU on Windows
failure_type "INVALID_TEST_RESULTS" video_decode_accelerator_d3d9_unittest on NVIDIA GPU on Windows
failure_type "INVALID_TEST_RESULTS" video_decode_accelerator_gl_unittest on NVIDIA GPU on Windows
failure_type "INVALID_TEST_RESULTS" context_lost_tests on NVIDIA GPU on Windows
failure_type "INVALID_TEST_RESULTS" depth_capture_tests on NVIDIA GPU on Windows
failure_type "INVALID_TEST_RESULTS" gpu_process_launch_tests on NVIDIA GPU on Windows
failure_type "INVALID_TEST_RESULTS" hardware_accelerated_feature_tests on NVIDIA GPU on Windows
failure_type "INVALID_TEST_RESULTS" info_collection_tests on NVIDIA GPU on Windows
failure_type "INVALID_TEST_RESULTS" maps_pixel_test on NVIDIA GPU on Windows
failure_type "INVALID_TEST_RESULTS" pixel_test on NVIDIA GPU on Windows
failure_type "INVALID_TEST_RESULTS" screenshot_sync_tests on NVIDIA GPU on Windows
failure_type "INVALID_TEST_RESULTS" trace_test on NVIDIA GPU on Windows
failure_type "INVALID_TEST_RESULTS" webgl2_conformance_tests on NVIDIA GPU on Windows
failure_type "INVALID_TEST_RESULTS" webgl_conformance_d3d11_validating_tests on NVIDIA GPU on Windows
failure_type "INVALID_TEST_RESULTS" webgl_conformance_d3d9_passthrough_tests on NVIDIA GPU on Windows
failure_type "INVALID_TEST_RESULTS" webgl_conformance_d3d9_tests on NVIDIA GPU on Windows
failure_type "INVALID_TEST_RESULTS" webgl_conformance_gl_passthrough_tests on NVIDIA GPU on Windows
failure_type "INVALID_TEST_RESULTS" webgl_conformance_tests on NVIDIA GPU on Windows
swarm_hashes_refs/heads/master(at){#607124}_without_patch {"angle_end2end_tests": "41a7af5d56720238d2686924ae0fe705ef2ef2db", "angle_gles1_conformance_tests": "342434964434570d2ebe7ed89e1dbf566f8b8621", "angle_unittests": "203792010a11c38f4f6a3316562bad55be40afbb", "angle_white_box_tests": "6e6a1ff96b27ffedee8889be9d40152ab8fa583e", "browser_tests": "378e34e5b85b7b9daa1f986bf0b4dbf6b1ac6ce3", "gl_tests": "e49178a4dd0d05ca444aba47966bfb0224fca71a", "gl_unittests": "8c9ce7b7b21ae74fdecae30b2c9a13a518f13248", "gles2_conform_test": "3b330ea5b6ac5d2e5acda2f118a8a8c5ceff0de2", "gpu_unittests": "92bf6a4f9036042cd781aa564ad0f47d07cca54a", "telemetry_gpu_integration_test": "45b8092e83cde6a2273fae525d97bb5338fb1bbc", "video_decode_accelerator_unittest": "3602d2d3570e53007238ffc36acd59f639a539b9"} isolate tests (2)
failure_type "INVALID_TEST_RESULTS" angle_unittests on NVIDIA GPU on Windows (retry summary)
failure_type "INVALID_TEST_RESULTS" depth_capture_tests on NVIDIA GPU on Windows (retry summary)
failure_type "TEST_FAILURE" pixel_test on NVIDIA GPU on Windows (retry summary)
failure_type "TEST_FAILURE" gl_tests on NVIDIA GPU on Windows (retry summary)
failure_type "INVALID_TEST_RESULTS" gpu_unittests on NVIDIA GPU on Windows (retry summary)
failure_type "TEST_FAILURE" hardware_accelerated_feature_tests on NVIDIA GPU on Windows (retry summary)
failure_type "TEST_FAILURE" gl_tests_passthrough on NVIDIA GPU on Windows (retry summary)
failure_type "TEST_FAILURE" angle_white_box_tests on NVIDIA GPU on Windows (retry summary)
failure_type "TEST_FAILURE" angle_end2end_tests on NVIDIA GPU on Windows (retry summary)
failure_type "INVALID_TEST_RESULTS" gles2_conform_gl_test on NVIDIA GPU on Windows (retry summary)
failure_type "TEST_FAILURE" info_collection_tests on NVIDIA GPU on Windows (retry summary)
failure_type "TEST_FAILURE" video_decode_accelerator_gl_unittest on NVIDIA GPU on Windows (retry summary)
failure_type "TEST_FAILURE" video_decode_accelerator_d3d11_unittest on NVIDIA GPU on Windows (retry summary)
failure_type "INVALID_TEST_RESULTS" gles2_conform_d3d9_test on NVIDIA GPU on Windows (retry summary)
failure_type "TEST_FAILURE" maps_pixel_test on NVIDIA GPU on Windows (retry summary)
failure_type "INVALID_TEST_RESULTS" angle_gles1_conformance_tests on NVIDIA GPU on Windows (retry summary)
failure_type "TEST_FAILURE" context_lost_tests on NVIDIA GPU on Windows (retry summary)
failure_type "TEST_FAILURE" gl_unittests on NVIDIA GPU on Windows (retry summary)
failure_type "INVALID_TEST_RESULTS" gles2_conform_test on NVIDIA GPU on Windows (retry summary)
failure_type "INVALID_TEST_RESULTS" tab_capture_end2end_tests on NVIDIA GPU on Windows (retry summary)
failure_type "INVALID_TEST_RESULTS" gpu_process_launch_tests on NVIDIA GPU on Windows (retry summary)
failure_type "TEST_FAILURE" trace_test on NVIDIA GPU on Windows (retry summary)
failure_type "INVALID_TEST_RESULTS" video_decode_accelerator_d3d9_unittest on NVIDIA GPU on Windows (retry summary)
failure_type "INVALID_TEST_RESULTS" screenshot_sync_tests on NVIDIA GPU on Windows (retry summary)
failure_type "INVALID_TEST_RESULTS" webgl_conformance_tests on NVIDIA GPU on Windows (retry summary)
failure_type "INVALID_TEST_RESULTS" webgl_conformance_gl_passthrough_tests on NVIDIA GPU on Windows (retry summary)
failure_type "INVALID_TEST_RESULTS" webgl_conformance_d3d9_passthrough_tests on NVIDIA GPU on Windows (retry summary)
failure_type "INVALID_TEST_RESULTS" webgl_conformance_vulkan_passthrough_tests on NVIDIA GPU on Windows (retry summary)
failure_type "INVALID_TEST_RESULTS" webgl_conformance_d3d9_tests on NVIDIA GPU on Windows (retry summary)
failure_type "INVALID_TEST_RESULTS" webgl2_conformance_tests on NVIDIA GPU on Windows (retry summary)
failure_type "TEST_FAILURE" webgl_conformance_d3d11_validating_tests on NVIDIA GPU on Windows (retry summary)
got_angle_revision "50bf0429394d3c1c191922cd45489db442785f75" bot_update (2)
got_buildtools_revision "13a00f110ef910a25763346d6538b60f12845656" bot_update (2)
got_dawn_revision "2960ec33667a11bb4445dfe8154aef133c741afe" bot_update (2)
got_nacl_revision "99673869a3cd8731d924bd32fa486feebfdc6c4f" bot_update (2)
got_revision "c1582e69def506093836a7cc6ba1e9c77c3b7a69" bot_update (2)
got_revision_cp "refs/heads/master@{#607124}" bot_update (2)
got_swarming_client_revision "f78187ab77127de42555afe0ad410bebde6ac6a5" bot_update (2)
got_v8_revision "9d6971eb2913c552f9f43609683e273c0051c6fc" bot_update (2)
got_v8_revision_cp "refs/heads/7.2.293@{#1}" bot_update (2)
got_webrtc_revision "e769ed90c3599a131166d5a61625c1b64318fb91" bot_update (2)
got_webrtc_revision_cp "refs/heads/master@{#25544}" bot_update (2)
swarm_hashes_refs/heads/master(at){#607124}_retry_with_patch {"angle_end2end_tests": "9a03b5e6f6600cb2797c7da0dbe41fc14660073e", "angle_gles1_conformance_tests": "29a8ca87e4a72c80e1b16d2bb3971302335316d6", "angle_unittests": "a733922fbdfa314255b4f903f0ef5389858c0ca8", "angle_white_box_tests": "52f2d290bdcdc25affaf1a0c9012ac459b630180", "browser_tests": "003fd1f720340c3b156e396c249f28b9b2fd95d8", "gl_tests": "e5fc7e5c6fb7f4c9b57dec7343f60a1c9c3be569", "gl_unittests": "9311353bed2637382471ee3d24dd1f8a6465fb6c", "gles2_conform_test": "14536e2c318a570002a9e106e20dc2647d499f90", "gpu_unittests": "992cc8afd56d96150624e8b20cbf5e430902e6b7", "telemetry_gpu_integration_test": "ec38861eb2431861ed1ec34e53d9ebe55a4fa7c1", "video_decode_accelerator_unittest": "9788253899c320caa1ad993e7e734b42eb0b271a"} isolate tests (3)

Timing:

Create Sunday, 11-Nov-18 09:02:15 UTC
Start Sunday, 11-Nov-18 09:02:29 UTC
End Sunday, 11-Nov-18 12:04:00 UTC
Pending 13 secs
Execution 3 hrs 1 mins